Missing file(s): /SeaMonkey.app/Contents/MacOS/components/dom_indexeddb.xpt

RESOLVED WORKSFORME

Status

SeaMonkey
Build Config
RESOLVED WORKSFORME
4 years ago
4 years ago

People

(Reporter: ewong, Assigned: ewong)

Tracking

Firefox Tracking Flags

(Not tracked)

Details

Attachments

(1 attachment)

(Assignee)

Description

4 years ago
On comm-central OSX build:

rm -f objdir/x86_64/mozilla/dist/universal
ln -s /builds/slave/c-cen-t-osx64/build/objdir/i386/mozilla/dist/universal objdir/x86_64/mozilla/dist/universal
make -C objdir/i386/suite/installer \
	   PKG_SKIP_STRIP=1 stage-package
/builds/slave/c-cen-t-osx64/build/objdir/i386/mozilla/_virtualenv/bin/python -m mozbuild.action.preprocessor -DOSTYPE=\"Darwin\" -DOSARCH=Darwin -DNO_NSPR_10_SUPPORT -DAB_CD=en-US -DMOZ_APP_NAME=seamonkey -DPREF_DIR=defaults/pref -DJAREXT= -DENABLE_TESTS=1 -DMOZ_PACKAGE_DEBUGQA=1 -DMOZ_URL_CLASSIFIER=1 -DMOZ_UPDATER=1 -DMOZ_MOVEMAIL=1 -DNECKO_WIFI=1 -DMOZ_SHARED_MOZGLUE=1 -DMOZ_CHILD_PROCESS_NAME=plugin-container -DDLL_PREFIX=lib -DDLL_SUFFIX=.dylib -DBIN_SUFFIX= -DMOZ_FOLD_LIBS=1 -DAPPNAME=SeaMonkey.app -DBINPATH=/SeaMonkey.app/Contents/MacOS -DMOZ_ICU_VERSION=52 -DMOZ_ICU_DBG_SUFFIX= -DCROSS_COMPILE='1' -DX_DISPLAY_MISSING='1' -DHAVE_X86_AVX2='1' -DMOZ_ENABLE_PROFILER_SPS='1' -DMOZILLA_VERSION='"33.0a1"' -DMOZILLA_VERSION_U='33.0a1' -DMOZILLA_UAVERSION='"33.0"' -DXP_MACOSX='1' -DXP_DARWIN='1' -DD_INO='d_ino' -DMOZ_DEBUG_SYMBOLS='1' -DSTDC_HEADERS='1' -DHAVE_SSIZE_T='1' -DHAVE_ST_BLKSIZE='1' -DHAVE_SIGINFO_T='1' -DHAVE_VISIBILITY_HIDDEN_ATTRIBUTE='1' -DHAVE_VISIBILITY_ATTRIBUTE='1' -DHAVE_DIRENT_H='1' -DHAVE_GETOPT_H='1' -DHAVE_MEMORY_H='1' -DHAVE_UNISTD_H='1' -DHAVE_NL_TYPES_H='1' -DHAVE_X11_XKBLIB_H='1' -DHAVE_CPUID_H='1' -DHAVE_SYS_TYPES_H='1' -DHAVE_NETINET_IN_H='1' -DHAVE_SIN_LEN='1' -DHAVE_SCONN_LEN='1' -DHAVE_SIN6_LEN='1' -DHAVE_SA_LEN='1' -DHAVE_SYS_CDEFS_H='1' -DHAVE_DLADDR='1' -DNO_X11='1' -DHAVE_STAT64='1' -DHAVE_LSTAT64='1' -DHAVE_LOCALTIME_R='1' -DHAVE_ARC4RANDOM='1' -DHAVE_LANGINFO_CODESET='1' -DVA_COPY='va_copy' -DHAVE_VA_COPY='1' -DMALLOC_H='<malloc/malloc.h>' -DHAVE_POSIX_MEMALIGN='1' -DHAVE_VALLOC='1' -DHAVE_I18N_LC_MESSAGES='1' -DHAVE_LOCALECONV='1' -DNS_ATTR_MALLOC='__attribute__((malloc))' -DNS_WARN_UNUSED_RESULT='__attribute__((warn_unused_result))' -DNIGHTLY_BUILD='1' -DMOZ_UPDATE_CHANNEL='default' -DEARLY_BETA_OR_EARLIER='1' -DMOZ_SUITE='1' -DMOZ_MORK='1' -DHAVE_MOVEMAIL='1' -DMOZ_BUILD_APP='../suite' -DMOZ_WIDGET_COCOA='1' -DMOZ_INSTRUMENT_EVENT_LOOP='1' -DNS_PRINTING='1' -DNS_PRINT_PREVIEW='1' -DMOZ_DISTRIBUTION_ID='"org.mozilla"' -DACCESSIBILITY='1' -DMOZ_WEBRTC='1' -DMOZ_WEBRTC_ASSERT_ALWAYS='1' -DMOZ_WEBRTC_SIGNALING='1' -DMOZ_PEERCONNECTION='1' -DMOZ_SCTP='1' -DMOZ_SRTP='1' -DMOZ_SAMPLE_TYPE_FLOAT32='1' -DMOZ_WEBSPEECH='1' -DMOZ_RAW='1' -DATTRIBUTE_ALIGNED_MAX='64' -DMOZ_WEBM='1' -DMOZ_APPLEMEDIA='1' -DMOZ_MEDIA_NAVIGATOR='1' -DMOZ_VPX='1' -DMOZ_VPX_ERROR_CONCEALMENT='1' -DVPX_X86_ASM='1' -DMOZ_WAVE='1' -DMOZ_VORBIS='1' -DMOZ_OPUS='1' -DENABLE_SYSTEM_EXTENSION_DIRS='1' -DMOZ_WEBGL='1' -DMOZ_GAMEPAD='1' -DMOZ_CRASHREPORTER='1' -DMOZ_CRASHREPORTER_ENABLE_PERCENT='100' -DLIBJPEG_TURBO_X86_ASM='1' -DMOZ_UPDATER='1' -DENABLE_TESTS='1' -DGTEST_HAS_RTTI='0' -DMOZ_CONTENT_SANDBOX_REPORTER='1' -DMOZ_FEEDS='1' -DMOZ_HELP_VIEWER='1' -DMOZ_URL_CLASSIFIER='1' -DGL_PROVIDER_='1' -DMOZ_LOGGING='1' -DJSGC_INCREMENTAL='1' -DMOZ_SERVICES_FXACCOUNTS='1' -DHAVE___CXA_DEMANGLE='1' -DHAVE__UNWIND_BACKTRACE='1' -DJS_DEFAULT_JITREPORT_GRANULARITY='3' -DMOZ_OMNIJAR='1' -DMOZ_USER_DIR='"Mozilla"' -DMOZ_TREE_PIXMAN='1' -DHAVE_STDINT_H='1' -DHAVE_INTTYPES_H='1' -DMOZ_TREE_CAIRO='1' -DMOZ_ENABLE_SKIA='1' -DUSE_SKIA='1' -DUSE_SKIA_GPU='1' -DMOZ_XUL='1' -DMOZ_PROFILELOCKING='1' -DENABLE_MARIONETTE='1' -DBUILD_CTYPES='1' -DMOZ_LOOP='1' -DMOZ_PLACES='1' -DMOZ_SOCIAL='1' -DMOZ_SERVICES_COMMON='1' -DMOZ_SERVICES_CRYPTO='1' -DMOZ_SERVICES_SYNC='1' -DMOZ_APP_COMPONENT_MODULES='MODULE(nsMailModule) MODULE(nsImportServiceModule) MODULE(nsLDAPProtocolModule) MODULE(nsMorkModule)' -DMOZ_MACBUNDLE_ID='org.mozilla.seamonkey' -DMOZ_B2G_VERSION='"1.0.0"' -DMOZ_B2G_OS_NAME='""' -DMOZ_APP_UA_NAME='""' -DMOZ_APP_UA_VERSION='"2.30a1"' -DFIREFOX_VERSION='33.0a1' -DMOZ_TELEMETRY_DISPLAY_REV='2' -DMOZ_DATA_REPORTING='1' -DMOZ_DLL_SUFFIX='".dylib"' -DXP_UNIX='1' -DA11Y_LOG='1' -DEXPOSE_INTL_API='1' -DENABLE_INTL_API='1' -DU_STATIC_IMPLEMENTATION='1' -DU_USING_ICU_NAMESPACE='0' -DMOZ_STATIC_JS='1' /builds/slave/c-cen-t-osx64/build/suite/installer/package-manifest.in -o package-manifest
OMNIJAR_NAME=omni.ja \
	/builds/slave/c-cen-t-osx64/build/objdir/i386/mozilla/_virtualenv/bin/python /builds/slave/c-cen-t-osx64/build/mozilla/toolkit/mozapps/installer/packager.py -DOSTYPE=\"Darwin\" -DOSARCH=Darwin -DNO_NSPR_10_SUPPORT -DAB_CD=en-US -DMOZ_APP_NAME=seamonkey -DPREF_DIR=defaults/pref -DJAREXT= -DENABLE_TESTS=1 -DMOZ_PACKAGE_DEBUGQA=1 -DMOZ_URL_CLASSIFIER=1 -DMOZ_UPDATER=1 -DMOZ_MOVEMAIL=1 -DNECKO_WIFI=1 -DMOZ_SHARED_MOZGLUE=1 -DMOZ_CHILD_PROCESS_NAME=plugin-container -DDLL_PREFIX=lib -DDLL_SUFFIX=.dylib -DBIN_SUFFIX= -DMOZ_FOLD_LIBS=1 -DAPPNAME=SeaMonkey.app -DBINPATH=/SeaMonkey.app/Contents/MacOS -DMOZ_ICU_VERSION=52 -DMOZ_ICU_DBG_SUFFIX= \
		--format omni \
		--removals /builds/slave/c-cen-t-osx64/build/suite/installer/removed-files.in \
		 \
		 \
		 \
		 \
		--optimizejars \
		--unify /builds/slave/c-cen-t-osx64/build/objdir/i386/../x86_64/mozilla/dist \
		package-manifest ../../mozilla/dist ../../mozilla/dist/universal/seamonkey \
		--non-resource defaults/messenger/mailViews.dat defaults/profile/localstore.rdf defaults/profile/panels.rdf 
Error: /builds/slave/c-cen-t-osx64/build/objdir/i386/suite/installer/package-manifest:95: Missing file(s): /SeaMonkey.app/Contents/MacOS/components/dom_indexeddb.xpt
Traceback (most recent call last):
  File "/builds/slave/c-cen-t-osx64/build/mozilla/toolkit/mozapps/installer/packager.py", line 402, in <module>
    main()
  File "/builds/slave/c-cen-t-osx64/build/mozilla/toolkit/mozapps/installer/packager.py", line 354, in main
    copier.add(mozpack.path.join(binpath, 'removed-files'), removals)
  File "/tools/python/lib/python2.7/contextlib.py", line 24, in __exit__
    self.gen.next()
  File "/builds/slave/c-cen-t-osx64/build/mozilla/python/mozbuild/mozpack/errors.py", line 129, in accumulate
    raise AccumulatedErrors()
mozpack.errors.AccumulatedErrors
make[2]: *** [stage-package] Error 1
make[1]: *** [postflight_all] Error 2
make: *** [build] Error 2
program finished with exit code 2
elapsedTime=5991.844742
(Assignee)

Updated

4 years ago
OS: Mac OS X → All
(Assignee)

Updated

4 years ago
Depends on: 1019194
(Assignee)

Updated

4 years ago
Assignee: nobody → ewong
Status: NEW → ASSIGNED
(Assignee)

Comment 1

4 years ago
Created attachment 8442058 [details] [diff] [review]
Remove dom_indexeddb.xpt from package-manifest.in (v1)
Attachment #8442058 - Flags: review?(bugspam.Callek)
Comment on attachment 8442058 [details] [diff] [review]
Remove dom_indexeddb.xpt from package-manifest.in (v1)

Empty patch
Attachment #8442058 - Flags: review?(bugspam.Callek) → review-

Comment 3

4 years ago
Fixed by comm-central changeset 852267c1a357
https://hg.mozilla.org/comm-central/rev/852267c1a357

> # HG changeset patch
> # User Ryan VanderMeulen <ryanvm@gmail.com>
> # Date 1403104604 14400
> # Node ID 852267c1a3571cf0f95c13e634bc3720da8deee1
> # Parent  445db1ef062daa66a3fc45bb27ca42588308e1a7
> Port packaging manifest changes from bug 1019194 to comm-central to fix bustage. a=me
Status: ASSIGNED → RESOLVED
Last Resolved: 4 years ago
Resolution: --- → WORKSFORME
Sorry about this.  :(
You need to log in before you can comment on or make changes to this bug.