make package completely broken missing files

RESOLVED WORKSFORME

Status

SeaMonkey
Build Config
RESOLVED WORKSFORME
4 years ago
4 years ago

People

(Reporter: kevink9876543, Assigned: ewong)

Tracking

Dependency tree / graph

Firefox Tracking Flags

(Not tracked)

Details

(Reporter)

Description

4 years ago
User Agent: Mozilla/5.0 (Windows NT 6.1) AppleWebKit/537.36 (KHTML, like Gecko) Iron/31.0.1700.0 Chrome/31.0.1700.0 Safari/537.36

Steps to reproduce:

Build SeaMonkey from c-c rev 53be54f7311a / m-c rev 5e74101ce59e on Linux i686 with the following mozconfig:

ac_add_options --disable-eme
ac_add_options --enable-application=suite
mk_add_options MOZ_OBJDIR=/media/mozilla/comm-central/objdir-sm-release
mk_add_options MOZ_MAKE_FLAGS="-j4"

Then cd to the object directory and run "make package".


Actual results:

SeaMonkey gets built, but make package fails with

Error: /media/mozilla/comm-central/objdir-sm-release/mozilla/suite/installer/package-manifest:246: Missing file(s): bin/components/contentSecurityPolicy.js
Error: /media/mozilla/comm-central/objdir-sm-release/mozilla/suite/installer/package-manifest:247: Missing file(s): bin/components/contentSecurityPolicy.manifest
Error: /media/mozilla/comm-central/objdir-sm-release/mozilla/suite/installer/package-manifest:587: Missing file(s): bin/distribution/extensions/{59c81df5-4b7a-477b-912d-4e0fdf64e5f2}.xpi
Error: /media/mozilla/comm-central/objdir-sm-release/mozilla/suite/installer/package-manifest:590: Missing file(s): bin/distribution/extensions/inspector@mozilla.org.xpi
Traceback (most recent call last):
  File "/media/mozilla/comm-central/mozilla/toolkit/mozapps/installer/packager.py", line 402, in <module>
    main()
  File "/media/mozilla/comm-central/mozilla/toolkit/mozapps/installer/packager.py", line 354, in main
    copier.add(mozpack.path.join(binpath, 'removed-files'), removals)
  File "/usr/lib/python2.7/contextlib.py", line 24, in __exit__
    self.gen.next()
  File "/media/mozilla/comm-central/mozilla/python/mozbuild/mozpack/errors.py", line 129, in accumulate
    raise AccumulatedErrors()
mozpack.errors.AccumulatedErrors
make[4]: *** [stage-package] Error 1
make[4]: Leaving directory `/media/mozilla/comm-central/objdir-sm-release/mozilla/suite/installer'
make[3]: *** [make-package] Error 2
make[3]: Leaving directory `/media/mozilla/comm-central/objdir-sm-release/mozilla/suite/installer'
make[2]: *** [default] Error 2
make[2]: Leaving directory `/media/mozilla/comm-central/objdir-sm-release/mozilla/suite/installer'
make[1]: *** [package] Error 2
make[1]: Leaving directory `/media/mozilla/comm-central/objdir-sm-release/mozilla'
make: *** [package] Error 2



Expected results:

Should have made a distributable tarball of the SeaMonkey build.
(Reporter)

Updated

4 years ago
OS: Windows 7 → Linux
(Assignee)

Comment 1

4 years ago
This is also happening with the Linux* builders.  Confirming.

rm -f objdir/x86_64/mozilla/dist/universal
ln -s /builds/slave/c-cen-t-osx64/build/objdir/i386/mozilla/dist/universal objdir/x86_64/mozilla/dist/universal
make -C objdir/i386/mozilla/suite/installer \
	   PKG_SKIP_STRIP=1 stage-package
/builds/slave/c-cen-t-osx64/build/objdir/i386/mozilla/_virtualenv/bin/python -m mozbuild.action.preprocessor -DOSTYPE=\"Darwin\" -DOSARCH=Darwin -DNO_NSPR_10_SUPPORT -DAB_CD=en-US -DMOZ_APP_NAME=seamonkey -DPREF_DIR=defaults/pref -DJAREXT= -DENABLE_TESTS=1 -DMOZ_PACKAGE_DEBUGQA=1 -DMOZ_URL_CLASSIFIER=1 -DMOZ_UPDATER=1 -DMOZ_MOVEMAIL=1 -DNECKO_WIFI=1 -DMOZ_SHARED_MOZGLUE=1 -DMOZ_CHILD_PROCESS_NAME=plugin-container -DDLL_PREFIX=lib -DDLL_SUFFIX=.dylib -DBIN_SUFFIX= -DMOZ_FOLD_LIBS=1 -DAPPNAME=SeaMonkey.app -DBINPATH=/SeaMonkey.app/Contents/MacOS -DMOZ_ICU_VERSION=52 -DMOZ_ICU_DBG_SUFFIX= -DCROSS_COMPILE='1' -DX_DISPLAY_MISSING='1' -DHAVE_X86_AVX2='1' -DMOZ_ENABLE_PROFILER_SPS='1' -DMOZ_PROFILING='1' -DMOZILLA_VERSION='"34.0a1"' -DMOZILLA_VERSION_U='34.0a1' -DMOZILLA_UAVERSION='"34.0"' -DXP_MACOSX='1' -DXP_DARWIN='1' -DD_INO='d_ino' -DMOZ_DEBUG_SYMBOLS='1' -DSTDC_HEADERS='1' -DHAVE_SSIZE_T='1' -DHAVE_ST_BLKSIZE='1' -DHAVE_SIGINFO_T='1' -DHAVE_VISIBILITY_HIDDEN_ATTRIBUTE='1' -DHAVE_VISIBILITY_ATTRIBUTE='1' -DHAVE_DIRENT_H='1' -DHAVE_GETOPT_H='1' -DHAVE_MEMORY_H='1' -DHAVE_UNISTD_H='1' -DHAVE_NL_TYPES_H='1' -DHAVE_X11_XKBLIB_H='1' -DHAVE_CPUID_H='1' -DHAVE_SYS_TYPES_H='1' -DHAVE_NETINET_IN_H='1' -DHAVE_SIN_LEN='1' -DHAVE_SCONN_LEN='1' -DHAVE_SIN6_LEN='1' -DHAVE_SA_LEN='1' -DHAVE_SYS_CDEFS_H='1' -DHAVE_DLADDR='1' -DHAVE_MEMMEM='1' -DNO_X11='1' -DHAVE_STAT64='1' -DHAVE_LSTAT64='1' -DHAVE_LOCALTIME_R='1' -DHAVE_ARC4RANDOM='1' -DHAVE_ARC4RANDOM_BUF='1' -DHAVE_LANGINFO_CODESET='1' -DVA_COPY='va_copy' -DHAVE_VA_COPY='1' -DMALLOC_H='<malloc/malloc.h>' -DHAVE_STRNDUP='1' -DHAVE_POSIX_MEMALIGN='1' -DHAVE_VALLOC='1' -DHAVE_I18N_LC_MESSAGES='1' -DHAVE_LOCALECONV='1' -DTARGET_XPCOM_ABI='"x86-gcc3"' -DNS_ATTR_MALLOC='__attribute__((malloc))' -DNS_WARN_UNUSED_RESULT='__attribute__((warn_unused_result))' -DNIGHTLY_BUILD='1' -DMOZ_UPDATE_CHANNEL='default' -DEARLY_BETA_OR_EARLIER='1' -DMOZ_SUITE='1' -DMOZ_MORK='1' -DHAVE_MOVEMAIL='1' -DMOZ_BUILD_APP='../suite' -DMOZ_WIDGET_COCOA='1' -DMOZ_INSTRUMENT_EVENT_LOOP='1' -DNS_PRINTING='1' -DNS_PRINT_PREVIEW='1' -DMOZ_DISTRIBUTION_ID='"org.mozilla"' -DACCESSIBILITY='1' -DMOZ_WEBRTC='1' -DMOZ_WEBRTC_ASSERT_ALWAYS='1' -DMOZ_WEBRTC_SIGNALING='1' -DMOZ_PEERCONNECTION='1' -DMOZ_SCTP='1' -DMOZ_SRTP='1' -DMOZ_SAMPLE_TYPE_FLOAT32='1' -DMOZ_WEBSPEECH='1' -DMOZ_RAW='1' -DATTRIBUTE_ALIGNED_MAX='64' -DMOZ_WEBM='1' -DMOZ_APPLEMEDIA='1' -DMOZ_FMP4='1' -DMOZ_EME='1' -DMOZ_MEDIA_NAVIGATOR='1' -DMOZ_VPX='1' -DMOZ_VPX_ERROR_CONCEALMENT='1' -DVPX_X86_ASM='1' -DMOZ_WAVE='1' -DMOZ_VORBIS='1' -DMOZ_OPUS='1' -DENABLE_SYSTEM_EXTENSION_DIRS='1' -DMOZ_GAMEPAD='1' -DMOZ_CRASHREPORTER='1' -DMOZ_CRASHREPORTER_ENABLE_PERCENT='100' -DLIBJPEG_TURBO_X86_ASM='1' -DMOZ_UPDATER='1' -DENABLE_TESTS='1' -DGTEST_HAS_RTTI='0' -DMOZ_GMP_SANDBOX='1' -DMOZ_FEEDS='1' -DMOZ_HELP_VIEWER='1' -DMOZ_URL_CLASSIFIER='1' -DGL_PROVIDER_='1' -DMOZ_LOGGING='1' -DJSGC_INCREMENTAL='1' -DJSGC_USE_EXACT_ROOTING='1' -DHAVE___CXA_DEMANGLE='1' -DHAVE__UNWIND_BACKTRACE='1' -DJS_DEFAULT_JITREPORT_GRANULARITY='3' -DMOZ_OMNIJAR='1' -DMOZ_USER_DIR='"Mozilla"' -DMOZ_TREE_PIXMAN='1' -DHAVE_STDINT_H='1' -DHAVE_INTTYPES_H='1' -DMOZ_TREE_CAIRO='1' -DMOZ_ENABLE_SKIA='1' -DUSE_SKIA='1' -DUSE_SKIA_GPU='1' -DMOZ_XUL='1' -DMOZ_PROFILELOCKING='1' -DENABLE_MARIONETTE='1' -DBUILD_CTYPES='1' -DMOZ_PLACES='1' -DMOZ_SOCIAL='1' -DMOZ_SERVICES_COMMON='1' -DMOZ_SERVICES_CRYPTO='1' -DMOZ_SERVICES_SYNC='1' -DMOZ_APP_COMPONENT_MODULES='MODULE(nsMailModule) MODULE(nsImportServiceModule) MODULE(nsLDAPProtocolModule) MODULE(nsMorkModule)' -DMOZ_MACBUNDLE_ID='org.mozilla.seamonkey' -DMOZ_B2G_VERSION='"1.0.0"' -DMOZ_B2G_OS_NAME='""' -DMOZ_APP_UA_NAME='""' -DMOZ_APP_UA_VERSION='"2.31a1"' -DFIREFOX_VERSION='34.0a1' -DMOZ_TELEMETRY_DISPLAY_REV='2' -DMOZ_DATA_REPORTING='1' -DMOZ_DLL_SUFFIX='".dylib"' -DXP_UNIX='1' -DA11Y_LOG='1' -DEXPOSE_INTL_API='1' -DENABLE_INTL_API='1' -DU_STATIC_IMPLEMENTATION='1' -DU_USING_ICU_NAMESPACE='0' -DMOZ_STATIC_JS='1' /builds/slave/c-cen-t-osx64/build/suite/installer/package-manifest.in -o package-manifest
OMNIJAR_NAME=omni.ja \
	/builds/slave/c-cen-t-osx64/build/objdir/i386/mozilla/_virtualenv/bin/python /builds/slave/c-cen-t-osx64/build/mozilla/toolkit/mozapps/installer/packager.py -DOSTYPE=\"Darwin\" -DOSARCH=Darwin -DNO_NSPR_10_SUPPORT -DAB_CD=en-US -DMOZ_APP_NAME=seamonkey -DPREF_DIR=defaults/pref -DJAREXT= -DENABLE_TESTS=1 -DMOZ_PACKAGE_DEBUGQA=1 -DMOZ_URL_CLASSIFIER=1 -DMOZ_UPDATER=1 -DMOZ_MOVEMAIL=1 -DNECKO_WIFI=1 -DMOZ_SHARED_MOZGLUE=1 -DMOZ_CHILD_PROCESS_NAME=plugin-container -DDLL_PREFIX=lib -DDLL_SUFFIX=.dylib -DBIN_SUFFIX= -DMOZ_FOLD_LIBS=1 -DAPPNAME=SeaMonkey.app -DBINPATH=/SeaMonkey.app/Contents/MacOS -DMOZ_ICU_VERSION=52 -DMOZ_ICU_DBG_SUFFIX= \
		--format omni \
		--removals /builds/slave/c-cen-t-osx64/build/suite/installer/removed-files.in \
		 \
		 \
		 \
		 \
		--optimizejars \
		--unify /builds/slave/c-cen-t-osx64/build/objdir/i386/../x86_64/mozilla/dist \
		package-manifest ../../dist ../../dist/universal/seamonkey \
		--non-resource defaults/messenger/mailViews.dat defaults/profile/localstore.rdf defaults/profile/panels.rdf defaults/profile/mimeTypes.rdf defaults/profile/chrome/userChrome-example.css defaults/profile/chrome/userContent-example.css 
Error: /builds/slave/c-cen-t-osx64/build/objdir/i386/mozilla/suite/installer/package-manifest:535: Missing file(s): /SeaMonkey.app/Contents/MacOS/distribution/extensions/{59c81df5-4b7a-477b-912d-4e0fdf64e5f2}.xpi
Error: /builds/slave/c-cen-t-osx64/build/objdir/i386/mozilla/suite/installer/package-manifest:538: Missing file(s): /SeaMonkey.app/Contents/MacOS/distribution/extensions/inspector@mozilla.org.xpi
Traceback (most recent call last):
  File "/builds/slave/c-cen-t-osx64/build/mozilla/toolkit/mozapps/installer/packager.py", line 402, in <module>
    main()
  File "/builds/slave/c-cen-t-osx64/build/mozilla/toolkit/mozapps/installer/packager.py", line 354, in main
    copier.add(mozpack.path.join(binpath, 'removed-files'), removals)
  File "/tools/python/lib/python2.7/contextlib.py", line 24, in __exit__
    self.gen.next()
  File "/builds/slave/c-cen-t-osx64/build/mozilla/python/mozbuild/mozpack/errors.py", line 129, in accumulate
    raise AccumulatedErrors()
mozpack.errors.AccumulatedErrors
make[2]: *** [stage-package] Error 1
make[1]: *** [postflight_all] Error 2
make: *** [build] Error 2
Status: UNCONFIRMED → NEW
Ever confirmed: true
(Assignee)

Comment 2

4 years ago
(In reply to Edmund Wong (:ewong) from comment #1)
> This is also happening with the Linux* builders.  Confirming.
> 
> rm -f objdir/x86_64/mozilla/dist/universal
> ln -s /builds/slave/c-cen-t-osx64/build/objdir/i386/mozilla/dist/universal
> objdir/x86_64/mozilla/dist/universal

*sigh*.  The above is for OSX64.  With Linux, this is what happens:

make make-package-internal
make[4]: Entering directory `/builds/slave/c-cen-t-lnx64/build/objdir/mozilla/suite/installer'
/builds/slave/c-cen-t-lnx64/build/objdir/mozilla/_virtualenv/bin/python -m mozbuild.action.preprocessor -DMOZ_GLUE_IN_PROGRAM -DOSTYPE=\"Linux2.6.32-220.7.1.el6\" -DOSARCH=Linux -DNO_NSPR_10_SUPPORT -DAB_CD=en-US -DMOZ_APP_NAME=seamonkey -DPREF_DIR=defaults/pref -DJAREXT= -DENABLE_TESTS=1 -DMOZ_ENABLE_GNOME_COMPONENT=1 -DMOZ_GTK2=1 -DMOZ_PACKAGE_DEBUGQA=1 -DMOZ_URL_CLASSIFIER=1 -DMOZ_UPDATER=1 -DMOZ_MOVEMAIL=1 -DNECKO_WIFI=1 -DMOZ_CHILD_PROCESS_NAME=plugin-container -DDLL_PREFIX=lib -DDLL_SUFFIX=.so -DBIN_SUFFIX= -DBINPATH=bin -DMOZ_ICU_VERSION=52 -DMOZ_ICU_DBG_SUFFIX= -DHAVE_64BIT_BUILD='1' -DMOZ_ENABLE_PROFILER_SPS='1' -DMOZ_PROFILING='1' -DMOZILLA_VERSION='"34.0a1"' -DMOZILLA_VERSION_U='34.0a1' -DMOZILLA_UAVERSION='"34.0"' -DXP_LINUX='1' -DD_INO='d_ino' -DMOZ_DEBUG_SYMBOLS='1' -DSTDC_HEADERS='1' -DHAVE_SSIZE_T='1' -DHAVE_ST_BLKSIZE='1' -DHAVE_SIGINFO_T='1' -DHAVE_VISIBILITY_HIDDEN_ATTRIBUTE='1' -DHAVE_VISIBILITY_ATTRIBUTE='1' -DHAVE_DIRENT_H='1' -DHAVE_GETOPT_H='1' -DHAVE_SYS_BITYPES_H='1' -DHAVE_MEMORY_H='1' -DHAVE_UNISTD_H='1' -DHAVE_GNU_LIBC_VERSION_H='1' -DHAVE_NL_TYPES_H='1' -DHAVE_MALLOC_H='1' -DHAVE_X11_XKBLIB_H='1' -DHAVE_CPUID_H='1' -DHAVE_SYS_QUOTA_H='1' -DHAVE_SYS_SYSMACROS_H='1' -DHAVE_LINUX_QUOTA_H='1' -DHAVE_LINUX_IF_ADDR_H='1' -DHAVE_LINUX_RTNETLINK_H='1' -DHAVE_SYS_TYPES_H='1' -DHAVE_NETINET_IN_H='1' -DHAVE_BYTESWAP_H='1' -DHAVE_SYS_CDEFS_H='1' -DHAVE_DLOPEN='1' -DHAVE_DLADDR='1' -DHAVE_MEMMEM='1' -DFUNCPROTO='15' -D_REENTRANT='1' -DHAVE_STAT64='1' -DHAVE_LSTAT64='1' -DHAVE_TRUNCATE64='1' -DHAVE_LOCALTIME_R='1' -DHAVE_CLOCK_MONOTONIC='1' -DHAVE_RES_NINIT='1' -DHAVE_LANGINFO_CODESET='1' -DVA_COPY='va_copy' -DHAVE_VA_COPY='1' -DHAVE_VA_LIST_AS_ARRAY='1' -DHAVE_THREAD_TLS_KEYWORD='1' -DMALLOC_H='<malloc.h>' -DHAVE_STRNDUP='1' -DHAVE_POSIX_MEMALIGN='1' -DHAVE_MEMALIGN='1' -DHAVE_VALLOC='1' -DHAVE_MALLOC_USABLE_SIZE='1' -DHAVE_I18N_LC_MESSAGES='1' -DHAVE_LOCALECONV='1' -DTARGET_XPCOM_ABI='"x86_64-gcc3"' -DNS_ATTR_MALLOC='__attribute__((malloc))' -DNS_WARN_UNUSED_RESULT='__attribute__((warn_unused_result))' -DNIGHTLY_BUILD='1' -DMOZ_UPDATE_CHANNEL='default' -DEARLY_BETA_OR_EARLIER='1' -DMOZ_SUITE='1' -DMOZ_MORK='1' -DHAVE_MOVEMAIL='1' -DMOZ_BUILD_APP='../suite' -DMOZ_X11='1' -DMOZ_WIDGET_GTK2='1' -DMOZ_WIDGET_GTK='2' -DMOZ_PDF_PRINTING='1' -DMOZ_ENABLE_XREMOTE='1' -DMOZ_INSTRUMENT_EVENT_LOOP='1' -DNS_PRINTING='1' -DNS_PRINT_PREVIEW='1' -DMOZ_DISTRIBUTION_ID='"org.mozilla"' -DMOZ_ENABLE_GNOMEVFS='1' -DMOZ_ENABLE_GCONF='1' -DMOZ_ENABLE_DBUS='1' -DACCESSIBILITY='1' -DMOZ_WEBRTC='1' -DMOZ_WEBRTC_ASSERT_ALWAYS='1' -DMOZ_WEBRTC_SIGNALING='1' -DMOZ_PEERCONNECTION='1' -DMOZ_SCTP='1' -DMOZ_SRTP='1' -DMOZ_SAMPLE_TYPE_FLOAT32='1' -DMOZ_WEBSPEECH='1' -DMOZ_RAW='1' -DATTRIBUTE_ALIGNED_MAX='64' -DMOZ_WEBM='1' -DMOZ_FFMPEG='1' -DMOZ_FMP4='1' -DMOZ_EME='1' -DMOZ_MEDIA_NAVIGATOR='1' -DMOZ_VPX='1' -DMOZ_VPX_ERROR_CONCEALMENT='1' -DVPX_X86_ASM='1' -DMOZ_WAVE='1' -DMOZ_VORBIS='1' -DMOZ_OPUS='1' -DENABLE_SYSTEM_EXTENSION_DIRS='1' -DMOZ_GAMEPAD='1' -DMOZ_CRASHREPORTER='1' -DMOZ_CRASHREPORTER_ENABLE_PERCENT='100' -DLIBJPEG_TURBO_X64_ASM='1' -DMOZ_UPDATER='1' -DENABLE_TESTS='1' -DGTEST_HAS_RTTI='0' -DMOZ_GMP_SANDBOX='1' -DMOZ_FEEDS='1' -DMOZ_HELP_VIEWER='1' -DMOZ_URL_CLASSIFIER='1' -DGL_PROVIDER_GLX='1' -DMOZ_LOGGING='1' -DMOZ_MEMORY='1' -DMOZ_MEMORY_LINUX='1' -DJSGC_INCREMENTAL='1' -DJSGC_USE_EXACT_ROOTING='1' -DHAVE___CXA_DEMANGLE='1' -DHAVE__UNWIND_BACKTRACE='1' -DJS_DEFAULT_JITREPORT_GRANULARITY='3' -DMOZ_OMNIJAR='1' -DMOZ_USER_DIR='".mozilla"' -DHAVE_FT_BITMAP_SIZE_Y_PPEM='1' -DHAVE_FT_GLYPHSLOT_EMBOLDEN='1' -DHAVE_FT_LOAD_SFNT_TABLE='1' -DHAVE_FONTCONFIG_FCFREETYPE_H='1' -DMOZ_TREE_PIXMAN='1' -DHAVE_STDINT_H='1' -DHAVE_INTTYPES_H='1' -DMOZ_TREE_CAIRO='1' -DMOZ_ENABLE_SKIA='1' -DUSE_SKIA='1' -DUSE_SKIA_GPU='1' -DMOZ_XUL='1' -DMOZ_PROFILELOCKING='1' -DENABLE_MARIONETTE='1' -DBUILD_CTYPES='1' -DMOZ_PLACES='1' -DMOZ_SOCIAL='1' -DMOZ_SERVICES_COMMON='1' -DMOZ_SERVICES_CRYPTO='1' -DMOZ_SERVICES_SYNC='1' -DMOZ_APP_COMPONENT_MODULES='MODULE(nsMailModule) MODULE(nsImportServiceModule) MODULE(nsLDAPProtocolModule) MODULE(nsMorkModule)' -DMOZ_MACBUNDLE_ID='org.mozilla.seamonkey' -DMOZ_B2G_VERSION='"1.0.0"' -DMOZ_B2G_OS_NAME='""' -DMOZ_APP_UA_NAME='""' -DMOZ_APP_UA_VERSION='"2.31a1"' -DFIREFOX_VERSION='34.0a1' -DMOZ_TELEMETRY_DISPLAY_REV='2' -DMOZ_DATA_REPORTING='1' -DMOZ_DLL_SUFFIX='".so"' -DHAVE_POSIX_FADVISE='1' -DHAVE_POSIX_FALLOCATE='1' -DXP_UNIX='1' -DMOZ_ACCESSIBILITY_ATK='1' -DATK_MAJOR_VERSION='1' -DATK_MINOR_VERSION='28' -DATK_REV_VERSION='0' -DA11Y_LOG='1' -DEXPOSE_INTL_API='1' -DENABLE_INTL_API='1' -DU_STATIC_IMPLEMENTATION='1' -DU_USING_ICU_NAMESPACE='0' -DMOZ_STATIC_JS='1' /builds/slave/c-cen-t-lnx64/build/suite/installer/package-manifest.in -o package-manifest
OMNIJAR_NAME=omni.ja \
/builds/slave/c-cen-t-lnx64/build/objdir/mozilla/_virtualenv/bin/python /builds/slave/c-cen-t-lnx64/build/mozilla/toolkit/mozapps/installer/packager.py -DMOZ_GLUE_IN_PROGRAM -DOSTYPE=\"Linux2.6.32-220.7.1.el6\" -DOSARCH=Linux -DNO_NSPR_10_SUPPORT -DAB_CD=en-US -DMOZ_APP_NAME=seamonkey -DPREF_DIR=defaults/pref -DJAREXT= -DENABLE_TESTS=1 -DMOZ_ENABLE_GNOME_COMPONENT=1 -DMOZ_GTK2=1 -DMOZ_PACKAGE_DEBUGQA=1 -DMOZ_URL_CLASSIFIER=1 -DMOZ_UPDATER=1 -DMOZ_MOVEMAIL=1 -DNECKO_WIFI=1 -DMOZ_CHILD_PROCESS_NAME=plugin-container -DDLL_PREFIX=lib -DDLL_SUFFIX=.so -DBIN_SUFFIX= -DBINPATH=bin -DMOZ_ICU_VERSION=52 -DMOZ_ICU_DBG_SUFFIX= \
	--format omni \
	--removals /builds/slave/c-cen-t-lnx64/build/suite/installer/removed-files.in \
	 \
	 \
	 \
	 \
	--optimizejars \
	 \
	package-manifest ../../dist ../../dist/seamonkey \
	--non-resource defaults/messenger/mailViews.dat defaults/profile/localstore.rdf defaults/profile/panels.rdf defaults/profile/mimeTypes.rdf defaults/profile/chrome/userChrome-example.css defaults/profile/chrome/userContent-example.css 
Error: /builds/slave/c-cen-t-lnx64/build/objdir/mozilla/suite/installer/package-manifest:168: Missing file(s): bin/components/libnkgnomevfs.so
Error: /builds/slave/c-cen-t-lnx64/build/objdir/mozilla/suite/installer/package-manifest:591: Missing file(s): bin/distribution/extensions/{59c81df5-4b7a-477b-912d-4e0fdf64e5f2}.xpi
Error: /builds/slave/c-cen-t-lnx64/build/objdir/mozilla/suite/installer/package-manifest:594: Missing file(s): bin/distribution/extensions/inspector@mozilla.org.xpi
Traceback (most recent call last):
  File "/builds/slave/c-cen-t-lnx64/build/mozilla/toolkit/mozapps/installer/packager.py", line 402, in <module>
    main()
  File "/builds/slave/c-cen-t-lnx64/build/mozilla/toolkit/mozapps/installer/packager.py", line 354, in main
    copier.add(mozpack.path.join(binpath, 'removed-files'), removals)
  File "/tools/python27/lib/python2.7/contextlib.py", line 24, in __exit__
    self.gen.next()
  File "/builds/slave/c-cen-t-lnx64/build/mozilla/python/mozbuild/mozpack/errors.py", line 129, in accumulate
    raise AccumulatedErrors()
mozpack.errors.AccumulatedErrors
make[4]: *** [stage-package] Error 1

However, since we don't have a proper windows build (and my updated c-c
is building), I'm going to assume this also applies to Windows.


Not exactly the same packages; but it is about make pkg, so this fits.
OS: Linux → All
(Assignee)

Updated

4 years ago
Assignee: nobody → ewong
Status: NEW → ASSIGNED
(Assignee)

Comment 3

4 years ago
One of the Linux* missing files is libnkgnomevfs.so and while it does
belong to this issue, the problem should be corrected once bug 1052263 lands
which will include the removal of that libnkgnomevfs entry.
(Assignee)

Comment 4

4 years ago
After talking to IanN over irc, I believe this bug will be fixed when
bug 1051642 (et. al) are fixed.

Am I correct, Ian?
Flags: needinfo?(iann_bugzilla)

Comment 5

4 years ago
I believe so.

Kevin, if you install the fixes from bug 1047981 and bug 1049800 locally that should fix it. Can you try and report back?
Flags: needinfo?(iann_bugzilla) → needinfo?(kevink9876543)
(Reporter)

Comment 6

4 years ago
Yes that does work.
Flags: needinfo?(kevink9876543)
(Assignee)

Updated

4 years ago
Depends on: 1047981, 1049800

Comment 7

4 years ago
Dependencies are fixed. Closing.
Status: ASSIGNED → RESOLVED
Last Resolved: 4 years ago
Resolution: --- → WORKSFORME
You need to log in before you can comment on or make changes to this bug.