Intermittent build.test.js | Build Integration tests make with GAIA_OPTIMIZE=1 BUILD_DEBUG=1 | Build Integration tests "after each" hook after "Component returned failure code: 0x80520006 (NS_ERROR_FILE_TARGET_DOES_NOT_EXIST)" error

RESOLVED WORKSFORME

Status

Firefox OS
Gaia::Build
RESOLVED WORKSFORME
4 years ago
4 years ago

People

(Reporter: RyanVM, Assigned: gduan)

Tracking

({intermittent-failure})

Firefox Tracking Flags

(Not tracked)

Details

Attachments

(1 attachment)

(Reporter)

Description

4 years ago
https://tbpl.mozilla.org/php/getParsedLog.php?id=46269143&tree=Mozilla-Inbound

b2g_ubuntu64_vm mozilla-inbound opt test gaia-build on 2014-08-19 08:29:34 PDT for push 133471646752
slave: tst-linux64-spot-1225

08:51:58     INFO -  TEST-START | Build Integration tests make with GAIA_OPTIMIZE=1 BUILD_DEBUG=1
08:54:58     INFO -  TEST-UNEXPECTED-FAIL | /builds/slave/test/gaia/build/test/integration/build.test.js | Build Integration tests make with GAIA_OPTIMIZE=1 BUILD_DEBUG=1
08:54:58     INFO -  TEST-END | Build Integration tests make with GAIA_OPTIMIZE=1 BUILD_DEBUG=1

08:55:01     INFO -  run-js-command gaia/post-app
08:55:01     INFO -  isExcludedFromZip error, file.path: /builds/slave/test/gaia/build_stage/keyboard/js/imes/latin/dictionaries/en_us.dict
08:55:01     INFO -  Exception: [Exception... "Component returned failure code: 0x80520006 (NS_ERROR_FILE_TARGET_DOES_NOT_EXIST) [nsILocalFile.isFile]"  nsresult: "0x80520006 (NS_ERROR_FILE_TARGET_DOES_NOT_EXIST)"  location: "JS frame :: resource://gre/modules/commonjs/toolkit/loader.js -> file:///builds/slave/test/gaia/build/webapp-zip.js :: WebappZip.prototype.isExcludedFromZip :: line 53"  data: no]
08:55:01     INFO -  undefined
08:55:01     INFO -  make[1]: Leaving directory `/builds/slave/test/gaia'
08:55:01     INFO -  stderr: make[1]: *** [post-app] Error 3
08:55:01     INFO -  error: Error: Command failed: make[1]: *** [post-app] Error 3
08:55:01     INFO -  TEST-UNEXPECTED-FAIL | /builds/slave/test/gaia/build/test/integration/build.test.js | Build Integration tests "after each" hook
Comment hidden (Treeherder Robot)
Comment hidden (Treeherder Robot)
Comment hidden (Treeherder Robot)
Comment hidden (Treeherder Robot)
Comment hidden (Treeherder Robot)
Comment hidden (Treeherder Robot)
Comment hidden (Treeherder Robot)
Comment hidden (Treeherder Robot)
Comment hidden (Treeherder Robot)
Comment hidden (Treeherder Robot)
Comment hidden (Treeherder Robot)
Comment hidden (Treeherder Robot)
Comment hidden (Treeherder Robot)
Comment hidden (Treeherder Robot)
Comment hidden (Treeherder Robot)
Comment hidden (Treeherder Robot)
Comment hidden (Treeherder Robot)
Comment hidden (Treeherder Robot)
Comment hidden (Treeherder Robot)
Comment hidden (Treeherder Robot)
Comment hidden (Treeherder Robot)
Comment hidden (Treeherder Robot)
Comment hidden (Treeherder Robot)
Comment hidden (Treeherder Robot)
Comment hidden (Treeherder Robot)
Comment hidden (Treeherder Robot)
Comment hidden (Treeherder Robot)
Comment hidden (Treeherder Robot)
Comment hidden (Treeherder Robot)
Comment hidden (Treeherder Robot)
Comment hidden (Treeherder Robot)
Comment hidden (Treeherder Robot)
Comment hidden (Treeherder Robot)
Comment hidden (Treeherder Robot)
Comment hidden (Treeherder Robot)
Comment hidden (Treeherder Robot)
Comment hidden (Treeherder Robot)
I don't suppose you could take a look at this intermittent failure? :-)
Flags: needinfo?(yurenju.mozilla)
Created attachment 8476583 [details] [review]
PR to master

It might solve this bug. Waiting for test result.
Comment hidden (Treeherder Robot)
Comment hidden (Treeherder Robot)
Comment hidden (Treeherder Robot)
Comment hidden (Treeherder Robot)
Comment hidden (Treeherder Robot)
Comment hidden (Treeherder Robot)
Comment on attachment 8476583 [details] [review]
PR to master

Hi Yuren,
could you help me to check if this fix make sense?
Thanks.
Attachment #8476583 - Flags: review?(yurenju.mozilla)
Attachment #8476583 - Flags: review?(yurenju.mozilla) → review+
Flags: needinfo?(yurenju.mozilla)
Assignee: nobody → gduan
Comment hidden (Treeherder Robot)
Comment hidden (Treeherder Robot)
Comment hidden (Treeherder Robot)
Comment hidden (Treeherder Robot)
Comment hidden (Treeherder Robot)
Comment hidden (Treeherder Robot)
Comment hidden (Treeherder Robot)
Comment hidden (Treeherder Robot)
Comment hidden (Treeherder Robot)
Comment hidden (Treeherder Robot)
Comment hidden (Treeherder Robot)
Comment hidden (Treeherder Robot)
Comment hidden (Treeherder Robot)
Comment hidden (Treeherder Robot)
Comment hidden (Treeherder Robot)
Comment hidden (Treeherder Robot)
Comment hidden (Treeherder Robot)
Comment hidden (Treeherder Robot)
Comment hidden (Treeherder Robot)
Comment hidden (Treeherder Robot)
Comment hidden (Treeherder Robot)
Comment hidden (Treeherder Robot)
Comment hidden (Treeherder Robot)
Comment hidden (Treeherder Robot)
Comment hidden (Treeherder Robot)
Comment hidden (Treeherder Robot)
Comment hidden (Treeherder Robot)
Comment hidden (Treeherder Robot)
Comment hidden (Treeherder Robot)
Comment hidden (Treeherder Robot)
Comment hidden (Treeherder Robot)
Comment hidden (Treeherder Robot)
Comment hidden (Treeherder Robot)
Comment hidden (Treeherder Robot)
Comment hidden (Treeherder Robot)
Comment hidden (Treeherder Robot)
Comment hidden (Treeherder Robot)
Comment hidden (Treeherder Robot)
Comment hidden (Treeherder Robot)
Comment hidden (Treeherder Robot)
Comment hidden (Treeherder Robot)
Comment hidden (Treeherder Robot)
Comment hidden (Treeherder Robot)
Comment hidden (Treeherder Robot)
Comment hidden (Treeherder Robot)
Comment hidden (Treeherder Robot)
Comment hidden (Treeherder Robot)
Comment hidden (Treeherder Robot)
Comment hidden (Treeherder Robot)
Comment hidden (Treeherder Robot)
Comment hidden (Treeherder Robot)
Comment hidden (Treeherder Robot)
Comment hidden (Treeherder Robot)
Comment hidden (Treeherder Robot)
Comment hidden (Treeherder Robot)
Comment hidden (Treeherder Robot)
Comment hidden (Treeherder Robot)
Comment hidden (Treeherder Robot)
Comment hidden (Treeherder Robot)
(Reporter)

Updated

4 years ago
Blocks: 1059455
George, may I know the status of this bug? Why this is not closed while the patch has been merged?

Found this bug while tracking the following test failure,
https://tbpl.mozilla.org/php/getParsedLog.php?id=47265050&tree=Gaia-Try

It seems we would still hit a similar error with the following line?
https://github.com/mozilla-b2g/gaia/blob/63a8b719e2ec81754b2d350597ce9f54917bb00d/build/webapp-zip.js#L118
Flags: needinfo?(gduan)
Comment hidden (Treeherder Robot)
Comment hidden (Treeherder Robot)
Comment hidden (Treeherder Robot)
Comment hidden (Treeherder Robot)
Comment hidden (Treeherder Robot)
Since failures don't ever appear again, marked as resolved.
Status: NEW → RESOLVED
Last Resolved: 4 years ago
Flags: needinfo?(gduan)
Resolution: --- → FIXED
(Reporter)

Updated

4 years ago
Resolution: FIXED → WORKSFORME
You need to log in before you can comment on or make changes to this bug.