Intermittent "make[7]: *** [../dist/bin/modules/sdk/bootstrap.js] Error 1" build failures

RESOLVED WORKSFORME

Status

()

Core
Build Config
RESOLVED WORKSFORME
3 years ago
3 years ago

People

(Reporter: RyanVM, Unassigned)

Tracking

({intermittent-failure})

Trunk
All
Linux
intermittent-failure
Points:
---

Firefox Tracking Flags

(Not tracked)

Details

(Reporter)

Description

3 years ago
https://treeherder.mozilla.org/ui/logviewer.html#?job_id=100576&repo=mozilla-beta

builder 	Linux mozilla-beta build
buildid 	20141016051041
builduid 	9e35e82a057d4162a90f1919a13ce525
results 	failure (2)
revision 	184bc1bea651
slave 		b-linux64-ix-0009
starttime 	Thu Oct 16 2014 08:11:32 GMT-0400 (Eastern Standard Time)

make -f copy_source.mk libs
make[7]: Entering directory `/builds/slave/m-beta-lx-00000000000000000000/build/obj-firefox/addon-sdk'
../config/nsinstall -R -m 644 '/builds/slave/m-beta-lx-00000000000000000000/build/addon-sdk/source/app-extension/bootstrap.js' '../dist/bin/modules/sdk'
../config/nsinstall -R -m 644 '/builds/slave/m-beta-lx-00000000000000000000/build/addon-sdk/source/lib/test.js' '../dist/bin/modules/commonjs'
../config/nsinstall -R -m 644 '/builds/slave/m-beta-lx-00000000000000000000/build/addon-sdk/source/lib/node/os.js' '../dist/bin/modules/commonjs/node'
../config/nsinstall: cannot make symbolic link /builds/slave/m-beta-lx-00000000000000000000/build/obj-firefox/dist/bin/modules/sdk/bootstrap.js: File exists
../config/nsinstall -R -m 644 '/builds/slave/m-beta-lx-00000000000000000000/build/addon-sdk/source/lib/method/Readme.md' '../dist/bin/modules/commonjs/method'
make[7]: *** [../dist/bin/modules/sdk/bootstrap.js] Error 1
make[7]: *** Deleting file `../dist/bin/modules/sdk/bootstrap.js'
make[7]: *** Waiting for unfinished jobs....
make[7]: Leaving directory `/builds/slave/m-beta-lx-00000000000000000000/build/obj-firefox/addon-sdk'
make[6]: *** [libs] Error 2
make[6]: Leaving directory `/builds/slave/m-beta-lx-00000000000000000000/build/obj-firefox/addon-sdk'
make[5]: *** [addon-sdk/libs] Error 2
make[5]: Leaving directory `/builds/slave/m-beta-lx-00000000000000000000/build/obj-firefox'
make[4]: *** [libs] Error 2
make[4]: Leaving directory `/builds/slave/m-beta-lx-00000000000000000000/build/obj-firefox'
make[3]: *** [default] Error 2
make[3]: Leaving directory `/builds/slave/m-beta-lx-00000000000000000000/build/obj-firefox'
make[2]: *** [realbuild] Error 2
make[2]: Leaving directory `/builds/slave/m-beta-lx-00000000000000000000/build'
make[1]: *** [profiledbuild] Error 2
make[1]: Leaving directory `/builds/slave/m-beta-lx-00000000000000000000/build'
make: *** [build] Error 2
State Changed: unlock buildroot
This looks like a dupe of bug 1082910.
(Reporter)

Comment 2

3 years ago
This one's actually starrable, though. Let's leave it open and just mark a dep.
Depends on: 1082910

Comment 3

3 years ago
Inactive; closing (see bug 1180138).
Status: NEW → RESOLVED
Last Resolved: 3 years ago
Resolution: --- → WORKSFORME
You need to log in before you can comment on or make changes to this bug.