Cannot open include file: 'plarena.h': No such file or directory

RESOLVED DUPLICATE of bug 1180065

Status

SeaMonkey
Build Config
RESOLVED DUPLICATE of bug 1180065
3 years ago
3 years ago

People

(Reporter: ewong, Unassigned)

Tracking

Trunk
x86_64
Windows Server 2008

Firefox Tracking Flags

(firefox42 affected)

Details

(Reporter)

Description

3 years ago
On a local nightly run:

cl -Foc:/builds/slave5/c-c-rpk/build/comm-central-trunk/objdir/security/nss/lib/util/quickder.obj -c -O1 -Zi -Fdc:/builds/slave5/c-c-rpk/build/comm-central-trunk/objdir/security/nss/lib/util/ -W3 -nologo -D_CRT_SECURE_NO_WARNINGS -D_CRT_NONSTDC_NO_WARNINGS -MD -we4002 -we4003 -we4004 -we4006 -we4009 -we4013 -we4015 -we4028 -we4033 -we4035 -we4045 -we4047 -we4053 -we4054 -we4063 -we4064 -we4078 -we4087 -we4090 -we4098 -we4390 -we4551 -we4553 -we4715 -FS -arch:IA32 -DXP_PC -UDEBUG -U_DEBUG -DNDEBUG -DWIN32 -D_X86_ -D_WINDOWS -DWIN95 -DUSE_UTIL_DIRECTLY -DNO_NSPR_10_SUPPORT -DSSL_DISABLE_DEPRECATED_CIPHER_SUITE_NAMES -Ic:/builds/slave5
/c-c-rpk/build/comm-central-trunk/objdir/dist/include/nspr -Ic:/builds/slave5/c-c-rpk/build/comm-central-trunk/objdir/dist/include/nspr -Ic:/builds/slave5/c-c-rpk/build/comm-central-trunk/objdir/dist/include/nss -Ic:/builds/slave5/c-c-rpk/build/comm-central-trunk/objdir/dist/private/nss  "/c/builds/slave5/c-c-rpk/build/comm-central-trunk/mozilla/security/nss/lib/util/quickder.c"
quickder.cc:\builds\slave5\c-c-rpk\build\comm-central-trunk\mozilla\security\nss\lib\util\secasn1.h(15) : fatal error C1083: Cannot open include file: 'plarena.h': No such file or directory
../../coreconf/rules.mk:384: recipe for target 'c:/builds/slave5/c-c-rpk/build/comm-central-trunk/objdir/security/nss/lib/util/quickder.obj' failed
mozmake.exe[5]: *** [c:/builds/slave5/c-c-rpk/build/comm-central-trunk/objdir/security/nss/lib/util/quickder.obj] Error 2
mozmake.exe[5]: Leaving directory 'c:/builds/slave5/c-c-rpk/build/comm-central-trunk/mozilla/security/nss/lib/util'
Makefile:468: recipe for target 'libs-nss/lib/util' failed
mozmake.exe[4]: *** [libs-nss/lib/util] Error 2
mozmake.exe[4]: Leaving directory 'C:/builds/slave5/c-c-rpk/build/comm-central-trunk/objdir/config/external/nss'
c:/builds/slave5/c-c-rpk/build/comm-central-trunk/mozilla/config/recurse.mk:71:
recipe for target 'config/external/nss/target' failed
mozmake.exe[3]: *** [config/external/nss/target] Error 2
mozmake.exe[3]: Leaving directory 'C:/builds/slave5/c-c-rpk/build/comm-central-trunk/objdir'
c:/builds/slave5/c-c-rpk/build/comm-central-trunk/mozilla/config/recurse.mk:32:
recipe for target 'compile' failed
mozmake.exe[2]: *** [compile] Error 2
mozmake.exe[2]: Leaving directory 'C:/builds/slave5/c-c-rpk/build/comm-central-trunk/objdir'
c:/builds/slave5/c-c-rpk/build/comm-central-trunk/mozilla/config/recurse.mk:130: recipe for target 'compile' failed
mozmake.exe[1]: *** [compile] Error 2
mozmake.exe[1]: Leaving directory 'C:/builds/slave5/c-c-rpk/build/comm-central-trunk/objdir/config'
c:/builds/slave5/c-c-rpk/build/comm-central-trunk/mozilla/config/rules.mk:549: recipe for target 'default' failed
pymake\..\..\mozmake.exe: *** [default] Error 2
(Reporter)

Updated

3 years ago
OS: Unspecified → Windows Server 2008
Hardware: Unspecified → x86_64
(Reporter)

Comment 1

3 years ago
This will be fixed by bug 1180065, so I'm duping this to that bug.
Status: NEW → RESOLVED
Last Resolved: 3 years ago
Resolution: --- → DUPLICATE
Duplicate of bug: 1180065
You need to log in before you can comment on or make changes to this bug.