Note: There are a few cases of duplicates in user autocompletion which are being worked on.

RuntimeError: File "mail/messengerLWTheme.css" not found in mail\themes\windows, mail\themes\windows

RESOLVED FIXED in Thunderbird 43.0

Status

Thunderbird
Build Config
RESOLVED FIXED
2 years ago
2 years ago

People

(Reporter: ewong, Unassigned)

Tracking

Trunk
Thunderbird 43.0
x86_64
Windows Server 2008

Firefox Tracking Flags

(Not tracked)

Details

(Whiteboard: Fixed by bug 1192954)

(Reporter)

Description

2 years ago
On TB WINNT 5.2 comm-central build,

slave: b-2008-ix-0114 

Getting this:

mozmake.exe[5]: Entering directory 'c:/builds/moz2_slave/tb-c-cen-w32-00000000000000000/build/objdir-tb/mail/themes'
rm -f '../../dist/bin/extensions/{972ce4c6-7e08-4474-a285-3208198ce6fd}/install.rdf'
c:/builds/moz2_slave/tb-c-cen-w32-00000000000000000/build/objdir-tb/_virtualenv/Scripts/python.exe -m mozbuild.action.preprocessor --depend .deps/install.rdf.pp --silence-missing-directive-warnings -DTHUNDERBIRD_VERSION='43.0a1' -DAB_CD=en-US -DNO_NSPR_10_SUPPORT -D_CRT_SECURE_NO_WARNINGS='1' -D_CRT_NONSTDC_NO_WARNINGS='1' -DHAVE_SEH_EXCEPTIONS='1' -DMOZ_MSVC_STL_WRAP_RAISE='1' -DWINVER='0x502' -D_WIN32_WINNT='0x502' -D_WIN32_IE='0x0603' -DMOZ_WINSDK_TARGETVER='0x06030000' -DMOZ_NTDDI_WIN7='0x06010000' -DMOZ_WINSDK_MAXVER='0x06030000' -DHAVE_IO_H='1' -DHAVE_SETBUF='1' -DHAVE_ISATTY='1' -DX_DISPLAY_MISSING='1' -DMOZ_ENABLE_PROFILER_SPS='1' -DMOZ_PROFILING='1' -DMOZILLA_VERSION='"43.0a1"' -DMOZILLA_VERSION_U='43.0a1' -DMOZILLA_UAVERSION='"43.0"' -DHAVE_SNPRINTF='1' -D_WINDOWS='1' -DWIN32='1' -DXP_WIN='1' -DXP_WIN32='1' -DHW_THREADS='1' -DSTDC_HEADERS='1' -DWIN32_LEAN_AND_MEAN='1' -DNOMINMAX='1' -DNO_X11='1' -D_X86_='1' -DD_INO='d_ino' -DMOZ_DEBUG_SYMBOLS='1' -DMALLOC_H='<malloc.h>' -DHAVE_MALLOC_H='1' -DMALLOC_USABLE_SIZE_CONST_PTR='const' -DTARGET_XPCOM_ABI='"x86-msvc"' -DMALLOC_H='<malloc.h>' -DHAVE_FORCEINLINE='1' -DHAVE_LOCALECONV='1' -DNIGHTLY_BUILD='1' -DE10S_TESTING_ONLY='1' -DNS_ENABLE_TSF='1' -DMOZ_UPDATE_CHANNEL='default' -DEARLY_BETA_OR_EARLIER='1' -DMOZ_BUILD_APP='../mail' -DMOZ_PDF_PRINTING='1' -DMOZ_INSTRUMENT_EVENT_LOOP='1' -DNS_PRINTING='1' -DNS_PRINT_PREVIEW='1' -DMOZ_DISTRIBUTION_ID='"org.mozilla"' -DACCESSIBILITY='1' -DMOZ_WEBRTC='1' -DMOZ_WEBRTC_ASSERT_ALWAYS='1' -DMOZ_WEBRTC_SIGNALING='1' -DMOZ_PEERCONNECTION='1' -DMOZ_SCTP='1' -DMOZ_SRTP='1' -DMOZ_SAMPLE_TYPE_FLOAT32='1' -DMOZ_WEBSPEECH='1' -DMOZ_WEBSPEECH_TEST_BACKEND='1' -DMOZ_RAW='1' -DMOZ_WEBM='1' -DMOZ_DIRECTSHOW='1' -DMOZ_WMF='1' -DMOZ_FMP4='1' -DMOZ_EME='1' -DMOZ_MEDIA_NAVIGATOR='1' -DMOZ_VPX='1' -DMOZ_VPX_ERROR_CONCEALMENT='1' -DVPX_X86_ASM='1' -DMOZ_VPX_NO_MEM_REPORTING='1' -DMOZ_WAVE='1' -DMOZ_VORBIS='1' -DMOZ_PERMISSIONS='1' -DENABLE_SYSTEM_EXTENSION_DIRS='1' -DMOZ_GAMEPAD='1' -DMOZ_CRASHREPORTER='1' -DMOZ_CRASHREPORTER_INJECTOR='1' -DMOZ_CRASHREPORTER_ENABLE_PERCENT='100' -DMOZ_LIBAV_FFT='1' -DMOZ_SIGNING='1' -DMOZ_MAINTENANCE_SERVICE='1' -DMOZ_VERIFY_MAR_SIGNATURE='1' -DMOZ_ENABLE_SIGNMAR='1' -DMOZ_UPDATER='1' -DENABLE_TESTS='1' -DGTEST_HAS_RTTI='0' -D_VARIADIC_MAX='10' -DMOZ_CONTENT_SANDBOX='1' -DMOZ_GMP_SANDBOX='1' -DMOZ_SANDBOX='1' -DMOZ_FEEDS='1' -DMOZ_SAFE_BROWSING='1' -DMOZ_URL_CLASSIFIER='1' -DGL_PROVIDER_='1' -DMOZ_STACKWALKING='1' -DMOZ_LOGGING='1' -DFORCE_PR_LOG='1' -DMOZ_REPLACE_MALLOC='1' -DMOZ_MEMORY='1' -DMOZ_MEMORY_WINDOWS='1' -DMOZ_THUNDERBIRD='1' -DMOZ_MORK='1' -DMOZ_MAPI_SUPPORT='1' -DMOZ_SECUREELEMENT='1' -DJS_DEFAULT_JITREPORT_GRANULARITY='3' -DMOZ_OMNIJAR='1' -DMOZ_USER_DIR='"Mozilla"' -DMOZ_TREE_PIXMAN='1' -DHAVE_STDINT_H='1' -DHAVE_INTTYPES_H='1' -DMOZ_TREE_CAIRO='1' -DHAVE_UINT64_T='1' -DMOZ_ENABLE_SKIA='1' -DUSE_SKIA='1' -DUSE_SKIA_GPU='1' -DMOZ_XUL='1' -DMOZ_PROFILELOCKING='1' -DENABLE_MARIONETTE='1' -DBUILD_CTYPES='1' -DMOZ_PLACES='1' -DMOZ_SOCIAL='1' -DMOZ_BINARY_EXTENSIONS='1' -DMOZ_JSDOWNLOADS='1' -DMOZ_MACBUNDLE_ID='org.mozilla.daily' -DMOZ_B2G_VERSION='"1.0.0"' -DMOZ_B2G_OS_NAME='""' -DMOZ_APP_UA_NAME='""' -DMOZ_APP_UA_VERSION='"43.0a1"' -DFIREFOX_VERSION='43.0a1' -DMOZ_TELEMETRY_DISPLAY_REV='2' -DMOZ_TELEMETRY_REPORTING='1' -DMOZ_TELEMETRY_ON_BY_DEFAULT='1' -DMOZ_DATA_REPORTING='1' -DMOZ_DLL_SUFFIX='".dll"' -DA11Y_LOG='1' -DEXPOSE_INTL_API='1' -DENABLE_INTL_API='1' -DU_USING_ICU_NAMESPACE='0' -DMOZ_STATIC_JS='1' -DNDEBUG -DTRIMMED 'c:/builds/moz2_slave/tb-c-cen-w32-00000000000000000/build/mail/themes/install.rdf' -o '../../dist/bin/extensions/{972ce4c6-7e08-4474-a285-3208198ce6fd}/install.rdf'
mozmake.exe[5]: Leaving directory 'c:/builds/moz2_slave/tb-c-cen-w32-00000000000000000/build/objdir-tb/mail/themes'
mozmake.exe[5]: Entering directory 'c:/builds/moz2_slave/tb-c-cen-w32-00000000000000000/build/objdir-tb/mail/themes/windows'
c:/builds/moz2_slave/tb-c-cen-w32-00000000000000000/build/objdir-tb/_virtualenv/Scripts/python.exe -m mozbuild.action.jar_maker   -j ../../../dist/bin/chrome -t c:/builds/moz2_slave/tb-c-cen-w32-00000000000000000/build -f flat  --relativesrcdir=mail/themes/windows -c c:/builds/moz2_slave/tb-c-cen-w32-00000000000000000/build/mail/themes/windows/en-US -DNDEBUG -DTRIMMED -DAB_CD=en-US -DNO_NSPR_10_SUPPORT -D_CRT_SECURE_NO_WARNINGS='1' -D_CRT_NONSTDC_NO_WARNINGS='1' -DHAVE_SEH_EXCEPTIONS='1' -DMOZ_MSVC_STL_WRAP_RAISE='1' -DWINVER='0x502' -D_WIN32_WINNT='0x502' -D_WIN32_IE='0x0603' -DMOZ_WINSDK_TARGETVER='0x06030000' -DMOZ_NTDDI_WIN7='0x06010000' -DMOZ_WINSDK_MAXVER='0x06030000' -DHAVE_IO_H='1' -DHAVE_SETBUF='1' -DHAVE_ISATTY='1' -DX_DISPLAY_MISSING='1' -DMOZ_ENABLE_PROFILER_SPS='1' -DMOZ_PROFILING='1' -DMOZILLA_VERSION='"43.0a1"' -DMOZILLA_VERSION_U='43.0a1' -DMOZILLA_UAVERSION='"43.0"' -DHAVE_SNPRINTF='1' -D_WINDOWS='1' -DWIN32='1' -DXP_WIN='1' -DXP_WIN32='1' -DHW_THREADS='1' -DSTDC_HEADERS='1' -DWIN32_LEAN_AND_MEAN='1' -DNOMINMAX='1' -DNO_X11='1' -D_X86_='1' -DD_INO='d_ino' -DMOZ_DEBUG_SYMBOLS='1' -DMALLOC_H='<malloc.h>' -DHAVE_MALLOC_H='1' -DMALLOC_USABLE_SIZE_CONST_PTR='const' -DTARGET_XPCOM_ABI='"x86-msvc"' -DMALLOC_H='<malloc.h>' -DHAVE_FORCEINLINE='1' -DHAVE_LOCALECONV='1' -DNIGHTLY_BUILD='1' -DE10S_TESTING_ONLY='1' -DNS_ENABLE_TSF='1' -DMOZ_UPDATE_CHANNEL='default' -DEARLY_BETA_OR_EARLIER='1' -DMOZ_BUILD_APP='../mail' -DMOZ_PDF_PRINTING='1' -DMOZ_INSTRUMENT_EVENT_LOOP='1' -DNS_PRINTING='1' -DNS_PRINT_PREVIEW='1' -DMOZ_DISTRIBUTION_ID='"org.mozilla"' -DACCESSIBILITY='1' -DMOZ_WEBRTC='1' -DMOZ_WEBRTC_ASSERT_ALWAYS='1' -DMOZ_WEBRTC_SIGNALING='1' -DMOZ_PEERCONNECTION='1' -DMOZ_SCTP='1' -DMOZ_SRTP='1' -DMOZ_SAMPLE_TYPE_FLOAT32='1' -DMOZ_WEBSPEECH='1' -DMOZ_WEBSPEECH_TEST_BACKEND='1' -DMOZ_RAW='1' -DMOZ_WEBM='1' -DMOZ_DIRECTSHOW='1' -DMOZ_WMF='1' -DMOZ_FMP4='1' -DMOZ_EME='1' -DMOZ_MEDIA_NAVIGATOR='1' -DMOZ_VPX='1' -DMOZ_VPX_ERROR_CONCEALMENT='1' -DVPX_X86_ASM='1' -DMOZ_VPX_NO_MEM_REPORTING='1' -DMOZ_WAVE='1' -DMOZ_VORBIS='1' -DMOZ_PERMISSIONS='1' -DENABLE_SYSTEM_EXTENSION_DIRS='1' -DMOZ_GAMEPAD='1' -DMOZ_CRASHREPORTER='1' -DMOZ_CRASHREPORTER_INJECTOR='1' -DMOZ_CRASHREPORTER_ENABLE_PERCENT='100' -DMOZ_LIBAV_FFT='1' -DMOZ_SIGNING='1' -DMOZ_MAINTENANCE_SERVICE='1' -DMOZ_VERIFY_MAR_SIGNATURE='1' -DMOZ_ENABLE_SIGNMAR='1' -DMOZ_UPDATER='1' -DENABLE_TESTS='1' -DGTEST_HAS_RTTI='0' -D_VARIADIC_MAX='10' -DMOZ_CONTENT_SANDBOX='1' -DMOZ_GMP_SANDBOX='1' -DMOZ_SANDBOX='1' -DMOZ_FEEDS='1' -DMOZ_SAFE_BROWSING='1' -DMOZ_URL_CLASSIFIER='1' -DGL_PROVIDER_='1' -DMOZ_STACKWALKING='1' -DMOZ_LOGGING='1' -DFORCE_PR_LOG='1' -DMOZ_REPLACE_MALLOC='1' -DMOZ_MEMORY='1' -DMOZ_MEMORY_WINDOWS='1' -DMOZ_THUNDERBIRD='1' -DMOZ_MORK='1' -DMOZ_MAPI_SUPPORT='1' -DMOZ_SECUREELEMENT='1' -DJS_DEFAULT_JITREPORT_GRANULARITY='3' -DMOZ_OMNIJAR='1' -DMOZ_USER_DIR='"Mozilla"' -DMOZ_TREE_PIXMAN='1' -DHAVE_STDINT_H='1' -DHAVE_INTTYPES_H='1' -DMOZ_TREE_CAIRO='1' -DHAVE_UINT64_T='1' -DMOZ_ENABLE_SKIA='1' -DUSE_SKIA='1' -DUSE_SKIA_GPU='1' -DMOZ_XUL='1' -DMOZ_PROFILELOCKING='1' -DENABLE_MARIONETTE='1' -DBUILD_CTYPES='1' -DMOZ_PLACES='1' -DMOZ_SOCIAL='1' -DMOZ_BINARY_EXTENSIONS='1' -DMOZ_JSDOWNLOADS='1' -DMOZ_MACBUNDLE_ID='org.mozilla.daily' -DMOZ_B2G_VERSION='"1.0.0"' -DMOZ_B2G_OS_NAME='""' -DMOZ_APP_UA_NAME='""' -DMOZ_APP_UA_VERSION='"43.0a1"' -DFIREFOX_VERSION='43.0a1' -DMOZ_TELEMETRY_DISPLAY_REV='2' -DMOZ_TELEMETRY_REPORTING='1' -DMOZ_TELEMETRY_ON_BY_DEFAULT='1' -DMOZ_DATA_REPORTING='1' -DMOZ_DLL_SUFFIX='".dll"' -DA11Y_LOG='1' -DEXPOSE_INTL_API='1' -DENABLE_INTL_API='1' -DU_USING_ICU_NAMESPACE='0' -DMOZ_STATIC_JS='1' c:/builds/moz2_slave/tb-c-cen-w32-00000000000000000/build/mail/themes/windows/jar.mn
processing c:/builds/moz2_slave/tb-c-cen-w32-00000000000000000/build/mail/themes/windows/jar.mn
c:/builds/moz2_slave/tb-c-cen-w32-00000000000000000/build/mozilla/config/rules.mk:1263: recipe for target 'libs' failed
mozmake.exe[5]: Leaving directory 'c:/builds/moz2_slave/tb-c-cen-w32-00000000000000000/build/objdir-tb/mail/themes/windows'
c:/builds/moz2_slave/tb-c-cen-w32-00000000000000000/build/mozilla/config/recurse.mk:79: recipe for target 'mail/themes/windows/libs' failed
mozmake.exe[4]: Leaving directory 'c:/builds/moz2_slave/tb-c-cen-w32-00000000000000000/build/objdir-tb'
c:/builds/moz2_slave/tb-c-cen-w32-00000000000000000/build/mozilla/config/recurse.mk:32: recipe for target 'libs' failed
mozmake.exe[3]: Leaving directory 'c:/builds/moz2_slave/tb-c-cen-w32-00000000000000000/build/objdir-tb'
c:/builds/moz2_slave/tb-c-cen-w32-00000000000000000/build/mozilla/config/rules.mk:549: recipe for target 'default' failed
mozmake.exe[2]: Leaving directory 'c:/builds/moz2_slave/tb-c-cen-w32-00000000000000000/build/objdir-tb'
c:/builds/moz2_slave/tb-c-cen-w32-00000000000000000/build/client.mk:404: recipe for target 'build' failed
mozmake.exe[1]: Leaving directory 'c:/builds/moz2_slave/tb-c-cen-w32-00000000000000000/build'
Traceback (most recent call last):
  File "c:\mozilla-build\python27\Lib\runpy.py", line 162, in _run_module_as_main
    "__main__", fname, loader, pkg_name)
  File "c:\mozilla-build\python27\Lib\runpy.py", line 72, in _run_code
    exec code in run_globals
  File "c:\builds\moz2_slave\tb-c-cen-w32-00000000000000000\build\mozilla\python\mozbuild\mozbuild\action\jar_maker.py", line 17, in <module>
    sys.exit(main(sys.argv[1:]))
  File "c:\builds\moz2_slave\tb-c-cen-w32-00000000000000000\build\mozilla\python\mozbuild\mozbuild\action\jar_maker.py", line 13, in main
    return mozbuild.jar.main(args)
  File "c:\builds\moz2_slave\tb-c-cen-w32-00000000000000000\build\mozilla\python\mozbuild\mozbuild\jar.py", line 557, in main
    jm.makeJar(infile, options.j)
  File "c:\builds\moz2_slave\tb-c-cen-w32-00000000000000000\build\mozilla\python\mozbuild\mozbuild\jar.py", line 257, in makeJar
    jardir)
  File "c:\builds\moz2_slave\tb-c-cen-w32-00000000000000000\build\mozilla\python\mozbuild\mozbuild\jar.py", line 355, in processJarSection
    self._processEntryLine(m, outHelper, jf)
  File "c:\builds\moz2_slave\tb-c-cen-w32-00000000000000000\build\mozilla\python\mozbuild\mozbuild\jar.py", line 412, in _processEntryLine
    ', '.join(src_base)))
RuntimeError: File "mail/messengerLWTheme.css" not found in c:\builds\moz2_slave\tb-c-cen-w32-00000000000000000\build\mail\themes\windows, c:\builds\moz2_slave\tb-c-cen-w32-00000000000000000\build\objdir-tb\mail\themes\windows
mozmake.exe[5]: *** [libs] Error -1
mozmake.exe[4]: *** [mail/themes/windows/libs] Error 2
mozmake.exe[3]: *** [libs] Error 2
mozmake.exe[2]: *** [default] Error 2
mozmake.exe[1]: *** [build] Error 2
client.mk:219: recipe for target 'build' failed
mozmake.exe: *** [build] Error 2
program finished with exit code 2
Comment hidden (Treeherder Robot)
Comment hidden (Treeherder Robot)
Comment hidden (Treeherder Robot)
Comment hidden (Treeherder Robot)
Flags: needinfo?(richard.marti)
This is because bug 1192969 was checked-in before the aero removal (bug 1192951-1192954) patches and the aero part in jar.mn wasn't changed.

There are two possibilities, first fix the jar.mn or second check-in the aero removal patches.

What should be done?
Flags: needinfo?(richard.marti)
Landed the aero removal patches. This should fix this.
Status: NEW → RESOLVED
Last Resolved: 2 years ago
Resolution: --- → FIXED
Whiteboard: Fixed by bug 1192954
Target Milestone: --- → Thunderbird 43.0
You need to log in before you can comment on or make changes to this bug.