Intermittent test_hashcompleter.js | completionFinished - [completionFinished : 330] true == false

RESOLVED WORKSFORME

Status

()

RESOLVED WORKSFORME
3 years ago
3 years ago

People

(Reporter: RyanVM, Unassigned)

Tracking

({intermittent-failure})

Firefox Tracking Flags

(Not tracked)

Details

(Reporter)

Description

3 years ago
13:59:59 INFO - TEST-START | toolkit/components/url-classifier/tests/unit/test_hashcompleter.js
14:00:05 WARNING - TEST-UNEXPECTED-FAIL | toolkit/components/url-classifier/tests/unit/test_hashcompleter.js | xpcshell return code: 0
14:00:05 INFO - TEST-INFO took 5929ms
14:00:05 INFO - >>>>>>>
14:00:05 INFO - PROCESS | 7408 | [7408] WARNING: Couldn't get the user appdata directory. Crash events may not be produced.: file c:/builds/moz2_slave/fx-team-w64-d-0000000000000000/build/src/toolkit/crashreporter/nsExceptionHandler.cpp, line 2320
14:00:05 INFO - PROCESS | 7408 | [7408] WARNING: This method is lossy. Use GetCanonicalPath !: file c:/builds/moz2_slave/fx-team-w64-d-0000000000000000/build/src/xpcom/io/nsLocalFileWin.cpp, line 3459
14:00:05 INFO - (xpcshell/head.js) | test MAIN run_test pending (1)
14:00:05 INFO - PROCESS | 7408 | Using seed of 1784421983 for random completion set.
14:00:05 INFO - PROCESS | 7408 | Using seed of 3219082336 for random completion set.
14:00:05 INFO - PROCESS | 7408 | Using seed of 3808454829 for random completion set.
14:00:05 INFO - PROCESS | 7408 | Using seed of 3609645222 for random completion set.
14:00:05 INFO - PROCESS | 7408 | Using seed of 322339268 for random completion set.
14:00:05 INFO - PROCESS | 7408 | Using seed of 278431366 for random completion set.
14:00:05 INFO - PROCESS | 7408 | Using seed of 28136050 for random completion set.
14:00:05 INFO - PROCESS | 7408 | Using seed of 2030519018 for random completion set.
14:00:05 INFO - PROCESS | 7408 | Using seed of 838276179 for random completion set.
14:00:05 INFO - PROCESS | 7408 | Using seed of 2821046462 for random completion set.
14:00:05 INFO - PROCESS | 7408 | Using seed of 2914235320 for random completion set.
14:00:05 INFO - (xpcshell/head.js) | test pending (2)
14:00:05 INFO - PROCESS | 7408 | Now on completion set index 0, length 3
14:00:05 INFO - (xpcshell/head.js) | test MAIN run_test finished (2)
14:00:05 INFO - running event loop
14:00:05 INFO - PROCESS | 7408 | [7408] WARNING: NS_ENSURE_SUCCESS(rv, rv) failed with result 0x80520012: file c:/builds/moz2_slave/fx-team-w64-d-0000000000000000/build/src/extensions/cookie/nsPermissionManager.cpp, line 2611
14:00:05 INFO - PROCESS | 7408 | JavaScript error: resource://gre/modules/Webapps.jsm, line 20: NS_ERROR_XPC_GS_RETURNED_FAILURE: Component returned failure code: 0x80570016 (NS_ERROR_XPC_GS_RETURNED_FAILURE) [nsIJSCID.getService]
14:00:05 INFO - "CONSOLE_MESSAGE: (info) Get a connection to permissions.sqlite."
14:00:05 INFO - PROCESS | 7408 | hashcompleter: cancelling request to http://localhost:61440/hash-completer
14:00:05 INFO - "CONSOLE_MESSAGE: (info) DB table(moz_perms) is created!"
14:00:05 INFO - "CONSOLE_MESSAGE: (error) [JavaScript Error: "NS_ERROR_XPC_GS_RETURNED_FAILURE: Component returned failure code: 0x80570016 (NS_ERROR_XPC_GS_RETURNED_FAILURE) [nsIJSCID.getService]" {file: "resource://gre/modules/Webapps.jsm" line: 20}]"
14:00:05 INFO - PROCESS | 7408 | hashcompleter: notifying failure
14:00:05 WARNING - TEST-UNEXPECTED-FAIL | toolkit/components/url-classifier/tests/unit/test_hashcompleter.js | completionFinished - [completionFinished : 330] true == false
14:00:05 INFO - C:/slave/test/build/tests/xpcshell/tests/toolkit/components/url-classifier/tests/unit/test_hashcompleter.js:completionFinished:330
14:00:05 INFO - resource://gre/components/nsUrlClassifierHashCompleter.js:HCR_notifyFailure:382
14:00:05 INFO - resource://gre/components/nsUrlClassifierHashCompleter.js:HCR_onStopRequest:436
14:00:05 INFO - C:\slave\test\build\tests\xpcshell\head.js:_do_main:207
14:00:05 INFO - C:\slave\test\build\tests\xpcshell\head.js:_execute_test:514
14:00:05 INFO - -e:null:1
14:00:05 INFO - null:null:0
14:00:05 INFO - exiting test
14:00:05 INFO - PROCESS | 7408 | JavaScript error: resource://gre/components/nsUrlClassifierHashCompleter.js, line 382: uncaught exception: 2147500036
14:00:05 INFO - PROCESS | 7408 | JavaScript error: resource://gre/components/nsUrlClassifierHashCompleter.js, line 382: NS_ERROR_ABORT: Abort'Abort' when calling method: [nsIUrlClassifierHashCompleterCallback::completionFinished]
14:00:05 INFO - "CONSOLE_MESSAGE: (error) [JavaScript Error: "uncaught exception: 2147500036" {file: "resource://gre/components/nsUrlClassifierHashCompleter.js" line: 382}]"
14:00:05 INFO - "CONSOLE_MESSAGE: (error) [JavaScript Error: "NS_ERROR_ABORT: Abort'Abort' when calling method: [nsIUrlClassifierHashCompleterCallback::completionFinished]" {file: "resource://gre/components/nsUrlClassifierHashCompleter.js" line: 382}]"
14:00:05 INFO - PROCESS | 7408 | JavaScript strict warning: resource://testing-common/httpd.js, line 791: ReferenceError: reference to undefined property this._stopCallback
14:00:05 INFO - PROCESS | 7408 | !!! error running onStopped callback: TypeError: callback is not a function
14:00:05 INFO - "CONSOLE_MESSAGE: (warn) [JavaScript Warning: "ReferenceError: reference to undefined property this._stopCallback" {file: "resource://testing-common/httpd.js" line: 791}]"
14:00:05 INFO - PROCESS | 7408 | [7408] WARNING: OOPDeinit() without successful OOPInit(): file c:/builds/moz2_slave/fx-team-w64-d-0000000000000000/build/src/toolkit/crashreporter/nsExceptionHandler.cpp, line 2798
14:00:05 INFO - PROCESS | 7408 | [7408] WARNING: XPCOM objects created/destroyed from static ctor/dtor: file c:/builds/moz2_slave/fx-team-w64-d-0000000000000000/build/src/xpcom/base/nsTraceRefcnt.cpp, line 152
14:00:05 INFO - PROCESS | 7408 | [7408] WARNING: XPCOM objects created/destroyed from static ctor/dtor: file c:/builds/moz2_slave/fx-team-w64-d-0000000000000000/build/src/xpcom/base/nsTraceRefcnt.cpp, line 152
14:00:05 INFO - PROCESS | 7408 | nsStringStats
14:00:05 INFO - PROCESS | 7408 | => mAllocCount: 4068
14:00:05 INFO - PROCESS | 7408 | => mReallocCount: 330
14:00:05 INFO - PROCESS | 7408 | => mFreeCount: 4068
14:00:05 INFO - PROCESS | 7408 | => mShareCount: 4507
14:00:05 INFO - PROCESS | 7408 | => mAdoptCount: 436
14:00:05 INFO - PROCESS | 7408 | => mAdoptFreeCount: 436
14:00:05 INFO - PROCESS | 7408 | => Process ID: 7408, Thread ID: 7936
14:00:05 INFO - <<<<<<<
Comment hidden (Treeherder Robot)
Comment hidden (Treeherder Robot)
[Mass Closure] Closing Intermittent as a one off
Status: NEW → RESOLVED
Last Resolved: 3 years ago
Resolution: --- → WORKSFORME
You need to log in before you can comment on or make changes to this bug.