Closed Bug 1224992 Opened 4 years ago Closed 2 years ago

Intermittent test_cellbroadcast_umts_language_and_body.js | ScriptTimeoutException: ScriptTimeoutException: timed out

Categories

(Firefox OS Graveyard :: RIL, defect)

ARM
Gonk (Firefox OS)
defect
Not set

Tracking

(Not tracked)

RESOLVED WONTFIX

People

(Reporter: edgar, Unassigned)

Details

(Keywords: leave-open)

https://treeherder.mozilla.org/logviewer.html#?job_id=13664280&repo=try

00:26:55     INFO -  TEST-START | test_cellbroadcast_umts_language_and_body.js
00:28:31    ERROR -  TEST-UNEXPECTED-ERROR | test_cellbroadcast_umts_language_and_body.js | ScriptTimeoutException: ScriptTimeoutException: timed out
00:28:31     INFO -  Traceback (most recent call last):
00:28:31     INFO -    File "/builds/slave/test/build/venv/local/lib/python2.7/site-packages/marionette/marionette_test.py", line 344, in run
00:28:31     INFO -      testMethod()
00:28:31     INFO -    File "/builds/slave/test/build/venv/local/lib/python2.7/site-packages/marionette/marionette_test.py", line 801, in runTest
00:28:31     INFO -      self.run_js_test(self.jsFile)
00:28:31     INFO -    File "/builds/slave/test/build/venv/local/lib/python2.7/site-packages/marionette/marionette_test.py", line 640, in run_js_test
00:28:31     INFO -      filename=os.path.basename(filename)
00:28:31     INFO -    File "/builds/slave/test/build/venv/local/lib/python2.7/site-packages/marionette_driver/marionette.py", line 1577, in execute_js_script
00:28:31     INFO -      rv = self._send_message("executeJSScript", body, key="value")
00:28:31     INFO -    File "/builds/slave/test/build/venv/local/lib/python2.7/site-packages/marionette_driver/decorators.py", line 36, in _
00:28:31     INFO -      return func(*args, **kwargs)
00:28:31     INFO -    File "/builds/slave/test/build/venv/local/lib/python2.7/site-packages/marionette_driver/marionette.py", line 721, in _send_message
00:28:31     INFO -      self._handle_error(err)
00:28:31     INFO -    File "/builds/slave/test/build/venv/local/lib/python2.7/site-packages/marionette_driver/marionette.py", line 782, in _handle_error
00:28:31     INFO -      raise errors.lookup(error)(message, stacktrace=stacktrace)
00:28:31     INFO -  TEST-INFO took 96829ms
Let's disable this unstable tests first.
Keywords: leave-open
Closing all intermittent test failures for Firefox OS (since we're not focusing on it anymore).

Please reopen if my search included your bug by mistake.
Firefox OS is not being worked on
Status: NEW → RESOLVED
Closed: 2 years ago
Resolution: --- → WONTFIX
You need to log in before you can comment on or make changes to this bug.