Status

Firefox Build System
Task Configuration
RESOLVED FIXED
3 years ago
5 months ago

People

(Reporter: dustin, Assigned: dustin)

Tracking

Firefox Tracking Flags

(Not tracked)

Details

...
npm http 200 https://registry.npmjs.org/predefine/-/predefine-0.1.2.tgz
npm http 200 https://registry.npmjs.org/connected/-/connected-0.0.2.tgz
npm http 200 https://registry.npmjs.org/debug/-/debug-0.7.4.tgz
npm http 200 https://registry.npmjs.org/one-time/-/one-time-0.0.4.tgz
npm http 200 https://registry.npmjs.org/requires-port
npm http GET https://registry.npmjs.org/requires-port/-/requires-port-1.0.0.tgz
npm http GET https://registry.npmjs.org/kuler
npm http GET https://registry.npmjs.org/colorspace
npm http GET https://registry.npmjs.org/enabled
npm http 200 https://registry.npmjs.org/requires-port/-/requires-port-1.0.0.tgz
npm http 200 https://registry.npmjs.org/enabled
npm http 200 https://registry.npmjs.org/kuler
npm http GET https://registry.npmjs.org/esprima-fb
npm http GET https://registry.npmjs.org/enabled/-/enabled-1.0.1.tgz
npm http GET https://registry.npmjs.org/kuler/-/kuler-0.0.0.tgz
npm http 200 https://registry.npmjs.org/colorspace
npm http GET https://registry.npmjs.org/colorspace/-/colorspace-1.0.1.tgz
npm http 200 https://registry.npmjs.org/kuler/-/kuler-0.0.0.tgz
npm http 200 https://registry.npmjs.org/esprima-fb
npm http 200 https://registry.npmjs.org/enabled/-/enabled-1.0.1.tgz
npm http GET https://registry.npmjs.org/esprima-fb/-/esprima-fb-10001.1.0-dev-harmony-fb.tgz
npm http 200 https://registry.npmjs.org/colorspace/-/colorspace-1.0.1.tgz
npm http 200 https://registry.npmjs.org/esprima-fb/-/esprima-fb-10001.1.0-dev-harmony-fb.tgz
npm http GET https://registry.npmjs.org/extendible
npm http GET https://registry.npmjs.org/color
npm http GET https://registry.npmjs.org/text-hex
npm http GET https://registry.npmjs.org/colornames/0.0.2
npm http GET https://registry.npmjs.org/env-variable
npm http GET https://registry.npmjs.org/sigmund
npm http 200 https://registry.npmjs.org/text-hex
npm http GET https://registry.npmjs.org/lru-cache/-/lru-cache-2.7.3.tgz
npm http GET https://registry.npmjs.org/string_decoder
npm http 200 https://registry.npmjs.org/sigmund
npm http GET https://registry.npmjs.org/inherits
npm http GET https://registry.npmjs.org/core-util-is
npm http GET https://registry.npmjs.org/isarray/0.0.1
npm http GET https://registry.npmjs.org/text-hex/-/text-hex-0.0.0.tgz
npm http 304 https://registry.npmjs.org/string_decoder
npm http GET https://registry.npmjs.org/sigmund/-/sigmund-1.0.1.tgz
npm http 304 https://registry.npmjs.org/inherits
npm http 200 https://registry.npmjs.org/env-variable
npm http 304 https://registry.npmjs.org/core-util-is
npm http 200 https://registry.npmjs.org/lru-cache/-/lru-cache-2.7.3.tgz
npm http 200 https://registry.npmjs.org/colornames/0.0.2
npm http 304 https://registry.npmjs.org/isarray/0.0.1
npm http GET https://registry.npmjs.org/env-variable/-/env-variable-0.0.3.tgz
npm http 200 https://registry.npmjs.org/color
npm http 200 https://registry.npmjs.org/text-hex/-/text-hex-0.0.0.tgz
npm http 200 https://registry.npmjs.org/sigmund/-/sigmund-1.0.1.tgz
npm http GET https://registry.npmjs.org/colornames/-/colornames-0.0.2.tgz
npm http GET https://registry.npmjs.org/color/-/color-0.8.0.tgz
npm http 200 https://registry.npmjs.org/env-variable/-/env-variable-0.0.3.tgz
npm http 200 https://registry.npmjs.org/colornames/-/colornames-0.0.2.tgz
npm http 200 https://registry.npmjs.org/color/-/color-0.8.0.tgz
npm http 200 https://registry.npmjs.org/extendible
npm http GET https://registry.npmjs.org/extendible/-/extendible-0.1.1.tgz
npm http 200 https://registry.npmjs.org/extendible/-/extendible-0.1.1.tgz
npm http GET https://registry.npmjs.org/color-convert
npm http GET https://registry.npmjs.org/color-string
npm http 200 https://registry.npmjs.org/color-string
npm http 200 https://registry.npmjs.org/color-convert
npm http GET https://registry.npmjs.org/color-convert/-/color-convert-0.5.3.tgz
npm http GET https://registry.npmjs.org/color-string/-/color-string-0.3.0.tgz
npm http 200 https://registry.npmjs.org/color-convert/-/color-convert-0.5.3.tgz
npm http 200 https://registry.npmjs.org/color-string/-/color-string-0.3.0.tgz
npm http GET https://registry.npmjs.org/color-name
npm http 200 https://registry.npmjs.org/color-name
npm http GET https://registry.npmjs.org/color-name/-/color-name-1.0.1.tgz
npm http 200 https://registry.npmjs.org/color-name/-/color-name-1.0.1.tgz
npm http GET https://registry.npmjs.org/inflight
npm http GET https://registry.npmjs.org/path-is-absolute
npm http GET https://registry.npmjs.org/once
npm http GET https://registry.npmjs.org/minimatch/-/minimatch-3.0.0.tgz
npm http 200 https://registry.npmjs.org/path-is-absolute
npm http 200 https://registry.npmjs.org/inflight
npm http GET https://registry.npmjs.org/path-is-absolute/-/path-is-absolute-1.0.0.tgz
npm http 304 https://registry.npmjs.org/once
npm http 200 https://registry.npmjs.org/minimatch/-/minimatch-3.0.0.tgz
npm http GET https://registry.npmjs.org/inflight/-/inflight-1.0.4.tgz
npm http GET https://registry.npmjs.org/acorn
npm http GET https://registry.npmjs.org/defined
npm http 200 https://registry.npmjs.org/inflight/-/inflight-1.0.4.tgz
npm http 200 https://registry.npmjs.org/path-is-absolute/-/path-is-absolute-1.0.0.tgz
npm http GET https://registry.npmjs.org/source-map
npm http GET https://registry.npmjs.org/ast-types/0.8.12
npm http 200 https://registry.npmjs.org/defined
npm http GET https://registry.npmjs.org/esprima-fb/-/esprima-fb-15001.1001.0-dev-harmony-fb.tgz
npm http GET https://registry.npmjs.org/defined/-/defined-1.0.0.tgz
npm http 200 https://registry.npmjs.org/acorn
npm http 200 https://registry.npmjs.org/acorn/-/acorn-1.2.2.tgz
npm http 200 https://registry.npmjs.org/source-map
npm http GET https://registry.npmjs.org/source-map/-/source-map-0.5.3.tgz
npm http GET https://registry.npmjs.org/wrappy
npm http 200 https://registry.npmjs.org/ast-types/-/ast-types-0.8.12.tgz
npm http GET https://registry.npmjs.org/brace-expansion
npm http 200 https://registry.npmjs.org/source-map/-/source-map-0.5.3.tgz
npm http 304 https://registry.npmjs.org/wrappy
npm http 200 https://registry.npmjs.org/brace-expansion
npm http GET https://registry.npmjs.org/brace-expansion/-/brace-expansion-1.1.2.tgz
npm http 200 https://registry.npmjs.org/brace-expansion/-/brace-expansion-1.1.2.tgz
npm http GET https://registry.npmjs.org/balanced-match
npm http GET https://registry.npmjs.org/concat-map/0.0.1
npm http 200 https://registry.npmjs.org/concat-map/0.0.1
npm http GET https://registry.npmjs.org/concat-map/-/concat-map-0.0.1.tgz
npm http 200 https://registry.npmjs.org/balanced-match
npm http GET https://registry.npmjs.org/balanced-match/-/balanced-match-0.3.0.tgz
npm http 200 https://registry.npmjs.org/concat-map/-/concat-map-0.0.1.tgz
npm http 200 https://registry.npmjs.org/balanced-match/-/balanced-match-0.3.0.tgz
npm http GET https://registry.npmjs.org/bindings
npm http GET https://registry.npmjs.org/nan/-/nan-2.1.0.tgz
npm http 200 https://registry.npmjs.org/nan/-/nan-2.1.0.tgz
npm http 200 https://registry.npmjs.org/bindings
npm http GET https://registry.npmjs.org/bindings/-/bindings-1.2.1.tgz
npm http GET https://registry.npmjs.org/forever-agent
npm http GET https://registry.npmjs.org/form-data
npm http GET https://registry.npmjs.org/extend
npm http GET https://registry.npmjs.org/json-stringify-safe
npm http GET https://registry.npmjs.org/mime-types
npm http GET https://registry.npmjs.org/node-uuid
npm http GET https://registry.npmjs.org/qs
npm http GET https://registry.npmjs.org/tunnel-agent
npm http GET https://registry.npmjs.org/tough-cookie
npm http GET https://registry.npmjs.org/http-signature
npm http GET https://registry.npmjs.org/oauth-sign
npm http GET https://registry.npmjs.org/aws-sign2
npm http GET https://registry.npmjs.org/stringstream
npm http GET https://registry.npmjs.org/isstream
npm http GET https://registry.npmjs.org/is-typedarray
npm http GET https://registry.npmjs.org/har-validator
npm http GET https://registry.npmjs.org/caseless
npm http 200 https://registry.npmjs.org/bindings/-/bindings-1.2.1.tgz
npm http GET https://registry.npmjs.org/hawk
npm http GET https://registry.npmjs.org/combined-stream
npm http GET https://registry.npmjs.org/bl
npm http 200 https://registry.npmjs.org/json-stringify-safe
npm http 304 https://registry.npmjs.org/extend
npm http GET https://registry.npmjs.org/json-stringify-safe/-/json-stringify-safe-5.0.1.tgz
npm http 200 https://registry.npmjs.org/forever-agent
npm http GET https://registry.npmjs.org/extend/-/extend-3.0.0.tgz
npm http 200 https://registry.npmjs.org/node-uuid
npm http 200 https://registry.npmjs.org/form-data
npm http 200 https://registry.npmjs.org/tunnel-agent
npm http GET https://registry.npmjs.org/forever-agent/-/forever-agent-0.6.1.tgz
npm http 200 https://registry.npmjs.org/http-signature
npm http 200 https://registry.npmjs.org/mime-types
npm http 200 https://registry.npmjs.org/oauth-sign
npm http 200 https://registry.npmjs.org/tough-cookie
npm http 200 https://registry.npmjs.org/qs
npm http 200 https://registry.npmjs.org/aws-sign2
npm http 200 https://registry.npmjs.org/stringstream
npm http 200 https://registry.npmjs.org/isstream
npm http 200 https://registry.npmjs.org/is-typedarray
npm http GET https://registry.npmjs.org/node-uuid/-/node-uuid-1.4.7.tgz
npm http GET https://registry.npmjs.org/form-data/-/form-data-1.0.0-rc3.tgz
npm http 200 https://registry.npmjs.org/har-validator
npm http 304 https://registry.npmjs.org/hawk
npm http 304 https://registry.npmjs.org/combined-stream
npm http 304 https://registry.npmjs.org/bl
npm http 200 https://registry.npmjs.org/json-stringify-safe/-/json-stringify-safe-5.0.1.tgz
npm http 200 https://registry.npmjs.org/caseless
npm http GET https://registry.npmjs.org/tunnel-agent/-/tunnel-agent-0.4.1.tgz
npm http 200 https://registry.npmjs.org/extend/-/extend-3.0.0.tgz
npm http GET https://registry.npmjs.org/http-signature/-/http-signature-1.1.0.tgz
npm http GET https://registry.npmjs.org/oauth-sign/-/oauth-sign-0.8.0.tgz
npm http GET https://registry.npmjs.org/mime-types/-/mime-types-2.1.8.tgz
npm http GET https://registry.npmjs.org/tough-cookie/-/tough-cookie-2.2.1.tgz
npm http GET https://registry.npmjs.org/qs/-/qs-5.2.0.tgz
npm http GET https://registry.npmjs.org/aws-sign2/-/aws-sign2-0.6.0.tgz
npm http GET https://registry.npmjs.org/stringstream/-/stringstream-0.0.5.tgz
npm http GET https://registry.npmjs.org/isstream/-/isstream-0.1.2.tgz
npm http GET https://registry.npmjs.org/is-typedarray/-/is-typedarray-1.0.0.tgz
npm http 200 https://registry.npmjs.org/forever-agent/-/forever-agent-0.6.1.tgz
npm http GET https://registry.npmjs.org/har-validator/-/har-validator-2.0.3.tgz
npm http GET https://registry.npmjs.org/combined-stream/-/combined-stream-1.0.5.tgz
npm http GET https://registry.npmjs.org/hawk/-/hawk-3.1.2.tgz
npm http GET https://registry.npmjs.org/caseless/-/caseless-0.11.0.tgz
npm http 200 https://registry.npmjs.org/node-uuid/-/node-uuid-1.4.7.tgz
npm http 200 https://registry.npmjs.org/tunnel-agent/-/tunnel-agent-0.4.1.tgz
npm http 200 https://registry.npmjs.org/oauth-sign/-/oauth-sign-0.8.0.tgz
npm http 200 https://registry.npmjs.org/form-data/-/form-data-1.0.0-rc3.tgz
npm http 200 https://registry.npmjs.org/tough-cookie/-/tough-cookie-2.2.1.tgz
npm http 200 https://registry.npmjs.org/mime-types/-/mime-types-2.1.8.tgz
npm http 200 https://registry.npmjs.org/http-signature/-/http-signature-1.1.0.tgz
npm http 200 https://registry.npmjs.org/aws-sign2/-/aws-sign2-0.6.0.tgz
npm http 200 https://registry.npmjs.org/stringstream/-/stringstream-0.0.5.tgz
npm http 200 https://registry.npmjs.org/qs/-/qs-5.2.0.tgz
npm http 200 https://registry.npmjs.org/isstream/-/isstream-0.1.2.tgz
npm http 200 https://registry.npmjs.org/is-typedarray/-/is-typedarray-1.0.0.tgz
npm http 200 https://registry.npmjs.org/har-validator/-/har-validator-2.0.3.tgz
npm http 200 https://registry.npmjs.org/combined-stream/-/combined-stream-1.0.5.tgz
npm http 200 https://registry.npmjs.org/hawk/-/hawk-3.1.2.tgz
npm http 200 https://registry.npmjs.org/caseless/-/caseless-0.11.0.tgz
npm http GET https://registry.npmjs.org/domhandler
npm http GET https://registry.npmjs.org/domutils
npm http GET https://registry.npmjs.org/domelementtype
npm http GET https://registry.npmjs.org/entities
npm http 200 https://registry.npmjs.org/entities
npm http 200 https://registry.npmjs.org/domhandler
npm http 200 https://registry.npmjs.org/domelementtype
npm http 200 https://registry.npmjs.org/domutils
npm http GET https://registry.npmjs.org/entities/-/entities-1.0.0.tgz
npm http GET https://registry.npmjs.org/domelementtype/-/domelementtype-1.3.0.tgz
npm http GET https://registry.npmjs.org/domhandler/-/domhandler-2.3.0.tgz
npm http GET https://registry.npmjs.org/domutils/-/domutils-1.5.1.tgz
npm http 200 https://registry.npmjs.org/domelementtype/-/domelementtype-1.3.0.tgz
npm http 200 https://registry.npmjs.org/entities/-/entities-1.0.0.tgz
npm http 200 https://registry.npmjs.org/domhandler/-/domhandler-2.3.0.tgz
npm http 200 https://registry.npmjs.org/domutils/-/domutils-1.5.1.tgz
npm http GET https://registry.npmjs.org/dom-serializer
npm http 200 https://registry.npmjs.org/dom-serializer
npm http GET https://registry.npmjs.org/dom-serializer/-/dom-serializer-0.1.0.tgz
npm http 200 https://registry.npmjs.org/dom-serializer/-/dom-serializer-0.1.0.tgz
npm http GET https://registry.npmjs.org/domelementtype/-/domelementtype-1.1.3.tgz
npm http GET https://registry.npmjs.org/entities/-/entities-1.1.1.tgz
npm http 200 https://registry.npmjs.org/domelementtype/-/domelementtype-1.1.3.tgz
npm http 200 https://registry.npmjs.org/entities/-/entities-1.1.1.tgz
npm WARN engine http-signature@1.1.0: wanted: {"node":">=0.8","npm":">=1.3.7"} (current: {"node":"v0.10.36","npm":"1.3.6"})
npm http GET https://registry.npmjs.org/delayed-stream
npm http GET https://registry.npmjs.org/mime-db
npm http 200 https://registry.npmjs.org/delayed-stream
npm http GET https://registry.npmjs.org/async
npm http 200 https://registry.npmjs.org/mime-db
npm http GET https://registry.npmjs.org/delayed-stream/-/delayed-stream-1.0.0.tgz
npm http GET https://registry.npmjs.org/mime-db/-/mime-db-1.20.0.tgz
npm http 304 https://registry.npmjs.org/async
npm http GET https://registry.npmjs.org/async/-/async-1.5.0.tgz
npm http 200 https://registry.npmjs.org/delayed-stream/-/delayed-stream-1.0.0.tgz
npm http 200 https://registry.npmjs.org/mime-db/-/mime-db-1.20.0.tgz
npm http GET https://registry.npmjs.org/sshpk
npm http GET https://registry.npmjs.org/assert-plus
npm http GET https://registry.npmjs.org/jsprim
npm http 200 https://registry.npmjs.org/async/-/async-1.5.0.tgz
npm http GET https://registry.npmjs.org/pinkie-promise
npm http GET https://registry.npmjs.org/is-my-json-valid
npm http GET https://registry.npmjs.org/chalk
npm http GET https://registry.npmjs.org/commander
npm http 200 https://registry.npmjs.org/assert-plus
npm http 304 https://registry.npmjs.org/chalk
npm http GET https://registry.npmjs.org/assert-plus/-/assert-plus-0.1.5.tgz
npm http 200 https://registry.npmjs.org/sshpk
npm http 200 https://registry.npmjs.org/jsprim
npm http 304 https://registry.npmjs.org/commander
npm http 200 https://registry.npmjs.org/pinkie-promise
npm http GET https://registry.npmjs.org/chalk/-/chalk-1.1.1.tgz
npm http GET https://registry.npmjs.org/commander/-/commander-2.9.0.tgz
npm http GET https://registry.npmjs.org/sshpk/-/sshpk-1.7.0.tgz
npm http GET https://registry.npmjs.org/jsprim/-/jsprim-1.2.2.tgz
npm http GET https://registry.npmjs.org/pinkie-promise/-/pinkie-promise-2.0.0.tgz
npm http 200 https://registry.npmjs.org/is-my-json-valid
npm http GET https://registry.npmjs.org/is-my-json-valid/-/is-my-json-valid-2.12.3.tgz
npm http 200 https://registry.npmjs.org/assert-plus/-/assert-plus-0.1.5.tgz
npm http 200 https://registry.npmjs.org/chalk/-/chalk-1.1.1.tgz
npm http 200 https://registry.npmjs.org/pinkie-promise/-/pinkie-promise-2.0.0.tgz
npm http 200 https://registry.npmjs.org/commander/-/commander-2.9.0.tgz
npm http 200 https://registry.npmjs.org/jsprim/-/jsprim-1.2.2.tgz
npm http 200 https://registry.npmjs.org/is-my-json-valid/-/is-my-json-valid-2.12.3.tgz
npm http 200 https://registry.npmjs.org/sshpk/-/sshpk-1.7.0.tgz
npm http GET https://registry.npmjs.org/process-nextick-args
npm http GET https://registry.npmjs.org/util-deprecate
npm http 304 https://registry.npmjs.org/process-nextick-args
npm http 304 https://registry.npmjs.org/util-deprecate
npm http GET https://registry.npmjs.org/hoek
npm http GET https://registry.npmjs.org/boom
npm http GET https://registry.npmjs.org/cryptiles
npm http GET https://registry.npmjs.org/sntp
npm http 304 https://registry.npmjs.org/cryptiles
npm http 304 https://registry.npmjs.org/hoek
npm http 304 https://registry.npmjs.org/sntp
npm http 304 https://registry.npmjs.org/boom

> contextify@0.1.15 install /usr/lib/node_modules/taskcluster-vcs/node_modules/taskcluster-client/node_modules/sockjs-client-node/node_modules/jsdom/node_modules/contextify
> node-gyp rebuild

npm WARN engine cryptiles@2.0.5: wanted: {"node":">=0.10.40"} (current: {"node":"v0.10.36","npm":"1.3.6"})
npm WARN engine hoek@2.16.3: wanted: {"node":">=0.10.40"} (current: {"node":"v0.10.36","npm":"1.3.6"})
npm WARN engine boom@2.10.1: wanted: {"node":">=0.10.40"} (current: {"node":"v0.10.36","npm":"1.3.6"})
npm http GET https://registry.npmjs.org/extsprintf/1.0.2
npm http GET https://registry.npmjs.org/json-schema/0.2.2
npm http GET https://registry.npmjs.org/verror/1.3.6
npm http 200 https://registry.npmjs.org/extsprintf/1.0.2
npm http 200 https://registry.npmjs.org/verror/1.3.6
npm http 200 https://registry.npmjs.org/json-schema/0.2.2
npm http GET https://registry.npmjs.org/extsprintf/-/extsprintf-1.0.2.tgz
npm http GET https://registry.npmjs.org/verror/-/verror-1.3.6.tgz
npm http GET https://registry.npmjs.org/json-schema/-/json-schema-0.2.2.tgz
npm http 200 https://registry.npmjs.org/extsprintf/-/extsprintf-1.0.2.tgz
npm http GET https://registry.npmjs.org/dashdash
npm http GET https://registry.npmjs.org/jsbn
npm http 200 https://registry.npmjs.org/json-schema/-/json-schema-0.2.2.tgz
npm http GET https://registry.npmjs.org/tweetnacl
npm http GET https://registry.npmjs.org/jodid25519
npm http GET https://registry.npmjs.org/ecc-jsbn
npm http GET https://registry.npmjs.org/asn1
make: Entering directory `/usr/lib/node_modules/taskcluster-vcs/node_modules/taskcluster-client/node_modules/sockjs-client-node/node_modules/jsdom/node_modules/contextify/build'
  CXX(target) Release/obj.target/contextify/src/contextify.o
npm http GET https://registry.npmjs.org/assert-plus/-/assert-plus-0.2.0.tgz
npm http 200 https://registry.npmjs.org/jodid25519
npm http 200 https://registry.npmjs.org/ecc-jsbn
npm http 200 https://registry.npmjs.org/verror/-/verror-1.3.6.tgz
npm http 200 https://registry.npmjs.org/jsbn
npm http 200 https://registry.npmjs.org/dashdash
npm http 200 https://registry.npmjs.org/asn1
npm http 200 https://registry.npmjs.org/assert-plus/-/assert-plus-0.2.0.tgz
npm http GET https://registry.npmjs.org/jodid25519/-/jodid25519-1.0.2.tgz
npm http GET https://registry.npmjs.org/ecc-jsbn/-/ecc-jsbn-0.1.1.tgz
npm http GET https://registry.npmjs.org/jsbn/-/jsbn-0.1.0.tgz
npm http GET https://registry.npmjs.org/dashdash/-/dashdash-1.10.1.tgz
npm http GET https://registry.npmjs.org/asn1/-/asn1-0.2.3.tgz
npm http GET https://registry.npmjs.org/pinkie
npm http 200 https://registry.npmjs.org/jsbn/-/jsbn-0.1.0.tgz
npm http 200 https://registry.npmjs.org/tweetnacl
npm http 200 https://registry.npmjs.org/jodid25519/-/jodid25519-1.0.2.tgz
npm http 200 https://registry.npmjs.org/asn1/-/asn1-0.2.3.tgz
npm http 200 https://registry.npmjs.org/ecc-jsbn/-/ecc-jsbn-0.1.1.tgz
npm http 200 https://registry.npmjs.org/dashdash/-/dashdash-1.10.1.tgz
npm http GET https://registry.npmjs.org/ansi-styles
npm http GET https://registry.npmjs.org/escape-string-regexp
npm http GET https://registry.npmjs.org/has-ansi
npm http GET https://registry.npmjs.org/strip-ansi
npm http GET https://registry.npmjs.org/supports-color
npm http 200 https://registry.npmjs.org/pinkie
npm http 304 https://registry.npmjs.org/supports-color
In file included from ../src/contextify.cc:3:
../node_modules/nan/nan.h:328: error: 'REPLACE_INVALID_UTF8' is not a member of 'v8::String'
npm http GET https://registry.npmjs.org/tweetnacl/-/tweetnacl-0.13.2.tgz
npm http GET https://registry.npmjs.org/supports-color/-/supports-color-2.0.0.tgz
npm http GET https://registry.npmjs.org/pinkie/-/pinkie-2.0.1.tgz
npm http 304 https://registry.npmjs.org/strip-ansi
npm http 304 https://registry.npmjs.org/ansi-styles
npm http 304 https://registry.npmjs.org/escape-string-regexp
npm http 304 https://registry.npmjs.org/has-ansi
make: *** [Release/obj.target/contextify/src/contextify.o] Error 1
make: Leaving directory `/usr/lib/node_modules/taskcluster-vcs/node_modules/taskcluster-client/node_modules/sockjs-client-node/node_modules/jsdom/node_modules/contextify/build'
gyp ERR! build error 
gyp ERR! stack Error: `make` failed with exit code: 2
gyp ERR! stack     at ChildProcess.onExit (/usr/lib/node_modules/node-gyp/lib/build.js:267:23)
gyp ERR! stack     at ChildProcess.emit (events.js:98:17)
gyp ERR! stack     at Process.ChildProcess._handle.onexit (child_process.js:820:12)
gyp ERR! System Linux 3.10.25-aufs-2014022401-aufs
gyp ERR! command "node" "/usr/lib/node_modules/npm/node_modules/node-gyp/bin/node-gyp.js" "rebuild"
gyp ERR! cwd /usr/lib/node_modules/taskcluster-vcs/node_modules/taskcluster-client/node_modules/sockjs-client-node/node_modules/jsdom/node_modules/contextify
gyp ERR! node -v v0.10.36
gyp ERR! node-gyp -v v0.10.6
gyp ERR! not ok 
npm http 200 https://registry.npmjs.org/supports-color/-/supports-color-2.0.0.tgz
npm http 200 https://registry.npmjs.org/pinkie/-/pinkie-2.0.1.tgz
npm http 200 https://registry.npmjs.org/tweetnacl/-/tweetnacl-0.13.2.tgz
npm http GET https://registry.npmjs.org/strip-ansi/-/strip-ansi-3.0.0.tgz
npm http GET https://registry.npmjs.org/ansi-styles/-/ansi-styles-2.1.0.tgz
npm http GET https://registry.npmjs.org/graceful-readlink
npm http GET https://registry.npmjs.org/has-ansi/-/has-ansi-2.0.0.tgz
npm http 200 https://registry.npmjs.org/ansi-styles/-/ansi-styles-2.1.0.tgz
npm http 200 https://registry.npmjs.org/graceful-readlink
npm http 200 https://registry.npmjs.org/strip-ansi/-/strip-ansi-3.0.0.tgz
npm http 200 https://registry.npmjs.org/has-ansi/-/has-ansi-2.0.0.tgz
npm http GET https://registry.npmjs.org/graceful-readlink/-/graceful-readlink-1.0.1.tgz
npm http 200 https://registry.npmjs.org/graceful-readlink/-/graceful-readlink-1.0.1.tgz
npm ERR! error rolling back Error: ENOTEMPTY, rmdir '/usr/lib/node_modules/taskcluster-vcs/node_modules/taskcluster-client/node_modules/sockjs-client-node/node_modules/jsdom/node_modules/request/node_modules/har-validator/node_modules/is-my-json-valid/test/json-schema-draft4'
npm ERR! error rolling back  jsdom@0.10.6 { [Error: ENOTEMPTY, rmdir '/usr/lib/node_modules/taskcluster-vcs/node_modules/taskcluster-client/node_modules/sockjs-client-node/node_modules/jsdom/node_modules/request/node_modules/har-validator/node_modules/is-my-json-valid/test/json-schema-draft4']
npm ERR! error rolling back   errno: 53,
npm ERR! error rolling back   code: 'ENOTEMPTY',
npm ERR! error rolling back   path: '/usr/lib/node_modules/taskcluster-vcs/node_modules/taskcluster-client/node_modules/sockjs-client-node/node_modules/jsdom/node_modules/request/node_modules/har-validator/node_modules/is-my-json-valid/test/json-schema-draft4' }
npm ERR! Error: ENOENT, lstat '/usr/lib/node_modules/taskcluster-vcs/node_modules/taskcluster-client/node_modules/sockjs-client-node/node_modules/jsdom/node_modules/request/node_modules/har-validator/node_modules/is-my-json-valid/test/json-schema-draft4/bignum.json'
npm ERR! If you need help, you may report this log at:
npm ERR!     <http://github.com/isaacs/npm/issues>
npm ERR! or email it to:
npm ERR!     <npm-@googlegroups.com>

npm ERR! System Linux 3.10.25-aufs-2014022401-aufs
npm ERR! command "node" "/usr/bin/npm" "install" "-g" "taskcluster-vcs@2.3.12"
npm ERR! cwd /root/build
npm ERR! node -v v0.10.36
npm ERR! npm -v 1.3.6
npm ERR! path /usr/lib/node_modules/taskcluster-vcs/node_modules/taskcluster-client/node_modules/sockjs-client-node/node_modules/jsdom/node_modules/request/node_modules/har-validator/node_modules/is-my-json-valid/test/json-schema-draft4/bignum.json
npm ERR! fstream_path /usr/lib/node_modules/taskcluster-vcs/node_modules/taskcluster-client/node_modules/sockjs-client-node/node_modules/jsdom/node_modules/request/node_modules/har-validator/node_modules/is-my-json-valid/test/json-schema-draft4/bignum.json
npm ERR! fstream_type File
npm ERR! fstream_class FileWriter
npm ERR! code ENOENT
npm ERR! errno 34
npm ERR! fstream_stack /usr/lib/node_modules/fstream/lib/writer.js:284:26
npm ERR! fstream_stack Object.oncomplete (fs.js:108:15)
npm WARN optional dep failed, continuing sockjs-client-node@0.1.1
/usr/bin/tc-vcs -> /usr/lib/node_modules/taskcluster-vcs/build/bin/tc-vcs.js
npm WARN unmet dependency /usr/lib/node_modules/block-stream requires inherits@'~2.0.0' but will load
npm WARN unmet dependency undefined,
npm WARN unmet dependency which is version undefined
npm WARN unmet dependency /usr/lib/node_modules/fstream requires inherits@'~2.0.0' but will load
npm WARN unmet dependency undefined,
npm WARN unmet dependency which is version undefined
npm WARN unmet dependency /usr/lib/node_modules/fstream-ignore requires inherits@'2' but will load
npm WARN unmet dependency undefined,
npm WARN unmet dependency which is version undefined
npm WARN unmet dependency /usr/lib/node_modules/fstream-npm requires inherits@'2' but will load
npm WARN unmet dependency undefined,
npm WARN unmet dependency which is version undefined
npm WARN unmet dependency /usr/lib/node_modules/glob requires inherits@'2' but will load
npm WARN unmet dependency undefined,
npm WARN unmet dependency which is version undefined
npm WARN unmet dependency /usr/lib/node_modules/npmconf requires inherits@'~2.0.0' but will load
npm WARN unmet dependency undefined,
npm WARN unmet dependency which is version undefined
npm WARN unmet dependency /usr/lib/node_modules/tar requires inherits@'2' but will load
npm WARN unmet dependency undefined,
npm WARN unmet dependency which is version undefined
taskcluster-vcs@2.3.12 /usr/lib/node_modules/taskcluster-vcs
├── event-to-promise@0.3.3
├── url-join@0.0.1
├── ms@0.7.1
├── json-templater@1.0.2
├── denodeify@1.2.1
├── deap@1.0.0
├── mustache@0.8.2
├── is-path-inside@1.0.0 (path-is-inside@1.0.1)
├── mz@1.3.0 (thenify-all@1.6.0, thenify@3.1.1, native-or-bluebird@1.2.0)
├── mkdirp@0.5.1 (minimist@0.0.8)
├── bluebird@2.10.2
├── argparse@0.1.16 (underscore.string@2.4.0, underscore@1.7.0)
├── tar-fs@1.8.1 (pump@1.0.1)
├── promised-temp@0.1.0 (debug@2.2.0, q@1.4.1, temp@0.8.3)
├── tar-stream@1.3.1 (xtend@4.0.1, bl@1.0.0, end-of-stream@1.1.0, readable-stream@2.0.4)
├── promise@7.0.4 (asap@2.0.3)
├── superagent-promise@0.2.0
├── superagent@0.21.0 (extend@1.2.1, methods@1.0.1, cookiejar@2.0.1, component-emitter@1.1.2, reduce-component@1.0.1, debug@2.2.0, qs@1.2.0, mime@1.2.11, readable-stream@1.0.27-1, formidable@1.0.14, form-data@0.1.3)
├── xml2js@0.4.15 (sax@1.1.4, xmlbuilder@4.1.0)
├── js-yaml@3.4.6 (inherit@2.2.2, esprima@2.7.0, argparse@1.0.3)
├── 6to5@3.6.5 (fs-readdir-recursive@0.1.0, supports-color@1.2.0, roadrunner@1.0.4, globals@5.1.0, js-tokenizer@1.3.3, private@0.1.6, commander@2.6.0, estraverse@1.9.1, esutils@1.1.6, debug@2.2.0, output-file-sync@1.1.0, ast-types@0.6.16, chalk@0.5.1, acorn-6to5@0.11.1-31, source-map@0.1.43, useragent@2.1.7, detect-indent@3.0.0, core-js@0.5.4, source-map-support@0.2.9, chokidar@0.12.6, lodash@3.0.0, regexpu@1.1.0, regenerator-6to5@0.8.10-1)
└── taskcluster-client@0.19.5 (debug@2.1.0, promise@6.0.1, slugid@1.0.3, lodash@2.4.1, hawk@2.3.0, amqplib@0.2.1, superagent-hawk@0.0.4)
npm ERR! Error: Callback called more than once.
npm ERR!     at errorHandler (/usr/lib/node_modules/npm/lib/utils/error-handler.js:80:16)
npm ERR!     at save (/usr/lib/node_modules/npm/lib/install.js:329:12)
npm ERR!     at /usr/lib/node_modules/npm/lib/install.js:98:7
npm ERR!     at /usr/lib/node_modules/npm/lib/install.js:188:5
npm ERR!     at /usr/lib/node_modules/read-installed/read-installed.js:119:5
npm ERR!     at /usr/lib/node_modules/read-installed/read-installed.js:233:14
npm ERR!     at cb (/usr/lib/node_modules/slide/lib/async-map.js:48:11)
npm ERR!     at /usr/lib/node_modules/read-installed/read-installed.js:233:14
npm ERR!     at cb (/usr/lib/node_modules/slide/lib/async-map.js:48:11)
npm ERR!     at /usr/lib/node_modules/read-installed/read-installed.js:233:14
npm ERR! If you need help, you may report this log at:
npm ERR!     <http://github.com/isaacs/npm/issues>
npm ERR! or email it to:
npm ERR!     <npm-@googlegroups.com>

npm ERR! System Linux 3.10.25-aufs-2014022401-aufs
npm ERR! command "node" "/usr/bin/npm" "install" "-g" "taskcluster-vcs@2.3.12"
npm ERR! cwd /root/build
npm ERR! node -v v0.10.36
npm ERR! npm -v 1.3.6
npm http GET https://registry.npmjs.org/ansi-regex
npm http 304 https://registry.npmjs.org/ansi-regex
npm http GET https://registry.npmjs.org/ansi-regex/-/ansi-regex-2.0.0.tgz
npm http 200 https://registry.npmjs.org/ansi-regex/-/ansi-regex-2.0.0.tgz
npm ERR! Error: ENOENT, lstat '/usr/lib/node_modules/taskcluster-vcs/node_modules/taskcluster-client/node_modules/sockjs-client-node/node_modules/jsdom/node_modules/request/node_modules/http-signature/node_modules/jsprim/node_modules/json-schema/draft-zyp-json-schema-03.xml'
npm ERR! If you need help, you may report this log at:
npm ERR!     <http://github.com/isaacs/npm/issues>
npm ERR! or email it to:
npm ERR!     <npm-@googlegroups.com>

npm ERR! System Linux 3.10.25-aufs-2014022401-aufs
npm ERR! command "node" "/usr/bin/npm" "install" "-g" "taskcluster-vcs@2.3.12"
npm ERR! cwd /root/build
npm ERR! node -v v0.10.36
npm ERR! npm -v 1.3.6
npm ERR! path /usr/lib/node_modules/taskcluster-vcs/node_modules/taskcluster-client/node_modules/sockjs-client-node/node_modules/jsdom/node_modules/request/node_modules/http-signature/node_modules/jsprim/node_modules/json-schema/draft-zyp-json-schema-03.xml
npm ERR! fstream_path /usr/lib/node_modules/taskcluster-vcs/node_modules/taskcluster-client/node_modules/sockjs-client-node/node_modules/jsdom/node_modules/request/node_modules/http-signature/node_modules/jsprim/node_modules/json-schema/draft-zyp-json-schema-03.xml
npm ERR! fstream_type File
npm ERR! fstream_class FileWriter
npm ERR! code ENOENT
npm ERR! errno 34
npm ERR! fstream_stack /usr/lib/node_modules/fstream/lib/writer.js:284:26
npm ERR! fstream_stack Object.oncomplete (fs.js:108:15)
npm ERR! 
npm ERR! Additional logging details can be found in:
npm ERR!     /root/build/npm-debug.log
npm ERR! not ok code 0
The command '/bin/sh -c bash /tmp/system-setup.sh' returned a non-zero code: 34

This occurs when building the centos6-build docker image from the in-tree specification.  I wonder if we shouldn't put tc-vcs in a tarball on tooltool instead of building it and all of its dependencies fresh on every image creation.

If i was forced to guess, I'd say that the `inherits` package is broken, and/or npm is broken.
I was hoping this was transient, but two failures yesterday and one today :( :(

John, any ideas to get this working again short-term?  Long-term I might build an RPM or the like so we're not invoking 'npm install' in the docker build process.
Flags: needinfo?(jhford)
Looks like the newest version, 2.3.18, builds fine.  Go figure :(
Assignee: nobody → dustin
..and the long-term fix here is to use shrinkwrap.  I'm testing a build now of 2.3.18, and if that works then I'll roll it into glandium's patch from bug 1228558.
Is it OK for me to push 2.3.19?
Flags: needinfo?(jopsen)
I don't know you npm nick, so I can't grant you access.
Also garndt is the owner, so probably best to ask him, but I see no reason not to push it.

What is your nick on npm?
Flags: needinfo?(jopsen) → needinfo?(dustin)
Added dustin on NPM... ni answered over irc.
Flags: needinfo?(dustin)

Comment 8

3 years ago
I don't see a reason not to push it.  I see that on IRC you created a handle and jonas might have added?

Just let me know if there is something I need to jump in and do.  Otherwise, push away.
Greg, the latest version on NPM is 2.3.22-alpha, but the latest version in the github repo is 2.3.17.  Am I missing something?  I guess that's a question for selenamarie, since npm says she made the release :)
Flags: needinfo?(sdeckelmann)
Ah, thanks for catching that.  I'll let her weigh in, but my guess is she was working on some pre-release versions and publishing to npm so that they can be installed in a docker image used.
(In reply to Greg Arndt [:garndt] from comment #10)
> Ah, thanks for catching that.  I'll let her weigh in, but my guess is she
> was working on some pre-release versions and publishing to npm so that they
> can be installed in a docker image used.

Yeah v2.3.22 would be what I publish once we get the right things in place for the emulator caching.  2.3.17 is fine for now.
Flags: needinfo?(sdeckelmann)
OK, so I won't deploy a 2.3.23 now since it sounds like that would induce failures.
Status: NEW → RESOLVED
Last Resolved: 3 years ago
Resolution: --- → FIXED

Updated

5 months ago
Product: TaskCluster → Firefox Build System
You need to log in before you can comment on or make changes to this bug.