Closed Bug 1231462 Opened 5 years ago Closed 2 years ago

Intermittent test_cellbroadcast_gsm_language_and_body.js | ScriptTimeoutException: ScriptTimeoutException: timed out

Categories

(Firefox OS Graveyard :: RIL, defect)

ARM
Gonk (Firefox OS)
defect
Not set
normal

Tracking

(Not tracked)

RESOLVED WONTFIX

People

(Reporter: edgar, Unassigned)

Details

(Keywords: leave-open)

+++ This bug was initially created as a clone of Bug #1224992 +++

https://treeherder.mozilla.org/logviewer.html#?job_id=14493596&repo=try

09:59:56     INFO -  TEST-START | test_cellbroadcast_gsm_language_and_body.js
10:01:35    ERROR -  TEST-UNEXPECTED-ERROR | test_cellbroadcast_gsm_language_and_body.js | ScriptTimeoutException: ScriptTimeoutException: timed out
10:01:35     INFO -  Traceback (most recent call last):
10:01:35     INFO -    File "/builds/slave/test/build/venv/local/lib/python2.7/site-packages/marionette/marionette_test.py", line 344, in run
10:01:35     INFO -      testMethod()
10:01:35     INFO -    File "/builds/slave/test/build/venv/local/lib/python2.7/site-packages/marionette/marionette_test.py", line 800, in runTest
10:01:35     INFO -      self.run_js_test(self.jsFile)
10:01:35     INFO -    File "/builds/slave/test/build/venv/local/lib/python2.7/site-packages/marionette/marionette_test.py", line 639, in run_js_test
10:01:35     INFO -      filename=os.path.basename(filename)
10:01:35     INFO -    File "/builds/slave/test/build/venv/local/lib/python2.7/site-packages/marionette_driver/marionette.py", line 1602, in execute_js_script
10:01:35     INFO -      rv = self._send_message("executeJSScript", body, key="value")
10:01:35     INFO -    File "/builds/slave/test/build/venv/local/lib/python2.7/site-packages/marionette_driver/decorators.py", line 36, in _
10:01:35     INFO -      return func(*args, **kwargs)
10:01:35     INFO -    File "/builds/slave/test/build/venv/local/lib/python2.7/site-packages/marionette_driver/marionette.py", line 741, in _send_message
10:01:35     INFO -      self._handle_error(err)
10:01:35     INFO -    File "/builds/slave/test/build/venv/local/lib/python2.7/site-packages/marionette_driver/marionette.py", line 802, in _handle_error
10:01:35     INFO -      raise errors.lookup(error)(message, stacktrace=stacktrace)
10:01:35     INFO -  TEST-INFO took 99016ms
Let's disable this unstable tests first.
Keywords: leave-open
Closing all intermittent test failures for Firefox OS (since we're not focusing on it anymore).

Please reopen if my search included your bug by mistake.
Firefox OS is not being worked on
Status: NEW → RESOLVED
Closed: 2 years ago
Resolution: --- → WONTFIX
You need to log in before you can comment on or make changes to this bug.