Closed Bug 1234746 Opened 4 years ago Closed 2 years ago

Intermittent test_mobile_operator_names_plmnlist.js | ScriptTimeoutException: ScriptTimeoutException: timed out

Categories

(Firefox OS Graveyard :: RIL, defect)

ARM
Gonk (Firefox OS)
defect
Not set

Tracking

(Not tracked)

RESOLVED WONTFIX

People

(Reporter: edgar, Unassigned)

Details

(Keywords: leave-open)

https://treeherder.mozilla.org/logviewer.html#?job_id=18854065&repo=mozilla-inbound

12:31:42     INFO -  TEST-START | test_mobile_operator_names_plmnlist.js
12:32:55    ERROR -  TEST-UNEXPECTED-ERROR | test_mobile_operator_names_plmnlist.js | ScriptTimeoutException: ScriptTimeoutException: timed out
12:32:55     INFO -  Traceback (most recent call last):
12:32:55     INFO -    File "/builds/slave/test/build/venv/local/lib/python2.7/site-packages/marionette/marionette_test.py", line 344, in run
12:32:55     INFO -      testMethod()
12:32:55     INFO -    File "/builds/slave/test/build/venv/local/lib/python2.7/site-packages/marionette/marionette_test.py", line 800, in runTest
12:32:55     INFO -      self.run_js_test(self.jsFile)
12:32:55     INFO -    File "/builds/slave/test/build/venv/local/lib/python2.7/site-packages/marionette/marionette_test.py", line 639, in run_js_test
12:32:55     INFO -      filename=os.path.basename(filename)
12:32:55     INFO -    File "/builds/slave/test/build/venv/local/lib/python2.7/site-packages/marionette_driver/marionette.py", line 1602, in execute_js_script
12:32:55     INFO -      rv = self._send_message("executeJSScript", body, key="value")
12:32:55     INFO -    File "/builds/slave/test/build/venv/local/lib/python2.7/site-packages/marionette_driver/decorators.py", line 36, in _
12:32:55     INFO -      return func(*args, **kwargs)
12:32:55     INFO -    File "/builds/slave/test/build/venv/local/lib/python2.7/site-packages/marionette_driver/marionette.py", line 741, in _send_message
12:32:55     INFO -      self._handle_error(err)
12:32:55     INFO -    File "/builds/slave/test/build/venv/local/lib/python2.7/site-packages/marionette_driver/marionette.py", line 802, in _handle_error
12:32:55     INFO -      raise errors.lookup(error)(message, stacktrace=stacktrace)
12:32:55     INFO -  TEST-INFO took 72494ms
The failure rate of test_mobile_operator_names_plmnlist.js is higher than I thought [1]. Let's disable this unstable test first.

[1] Please see bug 1081529 comment 16.
Keywords: leave-open
Closing all intermittent test failures for Firefox OS (since we're not focusing on it anymore).

Please reopen if my search included your bug by mistake.
Firefox OS is not being worked on
Status: NEW → RESOLVED
Closed: 2 years ago
Resolution: --- → WONTFIX
You need to log in before you can comment on or make changes to this bug.