Intermittent app_hosted_failed_icon_fetch_test.js | Vertical Home - Hosted app failed icon fetch fallback to default icon

RESOLVED WONTFIX

Status

RESOLVED WONTFIX
3 years ago
8 months ago

People

(Reporter: xidorn, Unassigned)

Tracking

({intermittent-failure})

Firefox Tracking Flags

(Not tracked)

Details

(Whiteboard: [systemsfe])

(Reporter)

Description

3 years ago
00:42:24     INFO -  TEST-UNEXPECTED-FAIL | apps/verticalhome/test/marionette/app_hosted_failed_icon_fetch_test.js | Vertical Home - Hosted app failed icon fetch fallback to default icon
 00:42:24     INFO -  AssertionError: '' == 'iwrotethis'
 00:42:24     INFO -      at Context.<anonymous> (apps/verticalhome/test/marionette/app_hosted_failed_icon_fetch_test.js:63:12)
 00:42:24     INFO -      at Test.MarionetteTest.run (node_modules/marionette-js-runner/lib/ui.js:25:31)
 00:42:24     INFO -      at apps/verticalhome/test/marionette/app_hosted_failed_icon_fetch_test.js:20:7
 00:42:24     INFO -      at ChildProcess.<anonymous> (apps/verticalhome/test/marionette/server/parent.js:183:5)
 00:42:24     INFO -      at handleMessage (internal/child_process.js:686:10)
 00:42:24     INFO -      at Pipe.channel.onread (internal/child_process.js:440:11)
 00:42:24     INFO -  TEST-END | apps/verticalhome/test/marionette/app_hosted_failed_icon_fetch_test.js | Vertical Home - Hosted app failed icon fetch fallback to default icon took 4225 ms
 00:42:29     INFO -  TEST-START | apps/verticalhome/test/marionette/app_hosted_install_test.js | Vertical Home - Hosted App Install install app
 00:42:51     INFO -  TEST-PASS | apps/verticalhome/test/marionette/app_hosted_install_test.js | Vertical Home - Hosted App Install install app
 00:42:51     INFO -  TEST-END | apps/verticalhome/test/marionette/app_hosted_install_test.js | Vertical Home - Hosted App Install install app took 2736 ms
 00:42:51     INFO -  *~*~* Results *~*~*
 00:42:51     INFO -  passed: 17
 00:42:51     INFO -  failed: 1
 00:42:51     INFO -  todo: 0
 00:42:51     INFO -    17 passing (7m)
 00:42:51     INFO -    1 failing
 00:42:51     INFO -    1) Vertical Home - Hosted app failed icon fetch fallback to default icon:
 00:42:51     INFO -    ssertionError: '' == 'iwrotethis'
 00:42:51     INFO -        at Context.<anonymous> (apps/verticalhome/test/marionette/app_hosted_failed_icon_fetch_test.js:63:12)
 00:42:51     INFO -        at Test.MarionetteTest.run (node_modules/marionette-js-runner/lib/ui.js:25:31)
 00:42:51     INFO -        at apps/verticalhome/test/marionette/app_hosted_failed_icon_fetch_test.js:20:7
 00:42:51     INFO -        at ChildProcess.<anonymous> (apps/verticalhome/test/marionette/server/parent.js:183:5)
 00:42:51     INFO -        at handleMessage (internal/child_process.js:686:10)
 00:42:51     INFO -        at Pipe.channel.onread (internal/child_process.js:440:11)
 00:42:51     INFO -  npm ERR! Linux 3.13.0-48-generic
 00:42:51     INFO -  npm ERR! argv "/usr/local/bin/node" "/usr/local/bin/npm" "run" "marionette" "--" "--buildapp=desktop" "--reporter=mocha-tbpl-reporter" "--marionette-capabilities=/home/worker/gaia/tests/jsmarionette/capabilities.json"
 00:42:51     INFO -  npm ERR! node v4.2.2
 00:42:51     INFO -  npm ERR! npm  v2.14.7
 00:42:51     INFO -  npm ERR! code ELIFECYCLE
 00:42:51     INFO -  npm ERR! gaia@0.0.3 marionette: `gaia-marionette "--buildapp=desktop" "--reporter=mocha-tbpl-reporter" "--marionette-capabilities=/home/worker/gaia/tests/jsmarionette/capabilities.json"`
 00:42:51     INFO -  npm ERR! Exit status 1
 00:42:51     INFO -  npm ERR!
 00:42:51     INFO -  npm ERR! Failed at the gaia@0.0.3 marionette script 'gaia-marionette "--buildapp=desktop" "--reporter=mocha-tbpl-reporter" "--marionette-capabilities=/home/worker/gaia/tests/jsmarionette/capabilities.json"'.
 00:42:51     INFO -  npm ERR! This is most likely a problem with the gaia package,
 00:42:51     INFO -  npm ERR! not with npm itself.
 00:42:51     INFO -  npm ERR! Tell the author that this fails on your system:
 00:42:51     INFO -  npm ERR!     gaia-marionette "--buildapp=desktop" "--reporter=mocha-tbpl-reporter" "--marionette-capabilities=/home/worker/gaia/tests/jsmarionette/capabilities.json"
 00:42:51     INFO -  npm ERR! You can get their info via:
 00:42:51     INFO -  npm ERR!     npm owner ls gaia
 00:42:51     INFO -  npm ERR! There is likely additional logging output above.
 00:42:51     INFO -  npm ERR! Please include the following file with any support request:
 00:42:51     INFO -  npm ERR!     /home/worker/gaia/npm-debug.log
 00:42:51     INFO -  make: *** [test-integration-test] Error 1
 00:42:51    ERROR - Return code: 2
Whiteboard: [systemsfe]
Component: Gaia → Gaia::Homescreen
5 automation job failures were associated with this bug in the last 7 days.

Repository breakdown:
* mozilla-inbound: 2
* mozilla-central: 1
* fx-team: 1
* b2g-inbound: 1

Platform breakdown:
* mulet-linux64: 4
* b2g-linux64: 1

For more details, see:
https://brasstacks.mozilla.com/orangefactor/?display=Bug&bugid=1236405&startday=2016-01-04&endday=2016-01-10&tree=all

Comment 2

2 years ago
Closing all intermittent test failures for Firefox OS (since we're not focusing on it anymore).

Please reopen if my search included your bug by mistake.

Comment 3

8 months ago
Firefox OS is not being worked on
Status: NEW → RESOLVED
Last Resolved: 8 months ago
Resolution: --- → WONTFIX
You need to log in before you can comment on or make changes to this bug.