Intermittent browser_chrome_back_forward_btn_test.js | Browser Chrome - Back/Forward button navigation back and forward

NEW
Unassigned

Status

Firefox OS
Gaia::System::Browser Chrome
2 years ago
9 months ago

People

(Reporter: nigelb, Unassigned)

Tracking

({intermittent-failure})

Firefox Tracking Flags

(Not tracked)

Details

(URL)

(Reporter)

Description

2 years ago
https://treeherder.mozilla.org/logviewer.html#?job_id=19206469&repo=mozilla-inbound

 07:13:27     INFO -  TEST-START | apps/system/test/marionette/browser_chrome_back_forward_btn_test.js | Browser Chrome - Back/Forward button navigation back and forward

 07:13:50     INFO -  TEST-UNEXPECTED-FAIL | apps/system/test/marionette/browser_chrome_back_forward_btn_test.js | Browser Chrome - Back/Forward button navigation back and forward

 07:13:50     INFO -  Crash detected but error running stackwalk

 07:13:50     INFO -  TEST-END | apps/system/test/marionette/browser_chrome_back_forward_btn_test.js | Browser Chrome - Back/Forward button navigation back and forward took 3602 ms

 07:13:50     INFO -  TEST-START | apps/system/test/marionette/browser_chrome_back_forward_btn_test.js | Browser Chrome - Back/Forward button browsing a 2nd website should display back icon

 07:14:19     INFO -  TEST-PASS | apps/system/test/marionette/browser_chrome_back_forward_btn_test.js | Browser Chrome - Back/Forward button browsing a 2nd website should display back icon

 07:14:19     INFO -  TEST-END | apps/system/test/marionette/browser_chrome_back_forward_btn_test.js | Browser Chrome - Back/Forward button browsing a 2nd website should display back icon took 11197 ms

 07:14:24     INFO -  TEST-START | apps/system/test/marionette/browser_chrome_packaged_app_layout_test.js | Browser - App /w Fullscreen Navigation Chrome hosted app /w chrome

 07:14:47     INFO -  TEST-PASS | apps/system/test/marionette/browser_chrome_packaged_app_layout_test.js | Browser - App /w Fullscreen Navigation Chrome hosted app /w chrome

 07:14:47     INFO -  TEST-END | apps/system/test/marionette/browser_chrome_packaged_app_layout_test.js | Browser - App /w Fullscreen Navigation Chrome hosted app /w chrome took 5383 ms

 07:14:53     INFO -  TEST-START | apps/system/test/marionette/browser_chrome_title_test.js | Browser Chrome - Title content app w/o chrome should use name from manifest

 07:15:18     INFO -  TEST-PASS | apps/system/test/marionette/browser_chrome_title_test.js | Browser Chrome - Title content app w/o chrome should use name from manifest

 07:15:18     INFO -  TEST-END | apps/system/test/marionette/browser_chrome_title_test.js | Browser Chrome - Title content app w/o chrome should use name from manifest took 3909 ms

 07:15:18     INFO -  TEST-START | apps/system/test/marionette/browser_chrome_title_test.js | Browser Chrome - Title content app /w chrome navigation should use name from manifest

 07:15:40     INFO -  TEST-PASS | apps/system/test/marionette/browser_chrome_title_test.js | Browser Chrome - Title content app /w chrome navigation should use name from manifest

 07:15:40     INFO -  TEST-END | apps/system/test/marionette/browser_chrome_title_test.js | Browser Chrome - Title content app /w chrome navigation should use name from manifest took 3270 ms

 07:15:40     INFO -  TEST-START | apps/system/test/marionette/browser_chrome_title_test.js | Browser Chrome - Title content website without app name should use hostname

 07:16:04     INFO -  TEST-PASS | apps/system/test/marionette/browser_chrome_title_test.js | Browser Chrome - Title content website without app name should use hostname

 07:16:04     INFO -  TEST-END | apps/system/test/marionette/browser_chrome_title_test.js | Browser Chrome - Title content website without app name should use hostname took 7058 ms

 07:16:05     INFO -  TEST-START | apps/system/test/marionette/browser_chrome_title_test.js | Browser Chrome - Title content Dont persist application-name

 07:16:38     INFO -  TEST-PASS | apps/system/test/marionette/browser_chrome_title_test.js | Browser Chrome - Title content Dont persist application-name

 07:16:38     INFO -  TEST-END | apps/system/test/marionette/browser_chrome_title_test.js | Browser Chrome - Title content Dont persist application-name took 11500 ms

 07:16:38     INFO -  *~*~* Results *~*~*

 07:16:38     INFO -  passed: 26

 07:16:38     INFO -  failed: 1

 07:16:38     INFO -  todo: 0

 07:16:38     INFO -    26 passing (12m)

 07:16:38     INFO -    1 failing

 07:16:38     INFO -    1) Browser Chrome - Back/Forward button navigation back and forward:

 07:16:38     INFO -        + expected - actual

 07:16:38     INFO -    rash detected but error running stackwalk

 07:16:39     INFO -  npm ERR! Linux 3.13.0-48-generic

 07:16:39     INFO -  npm ERR! argv "/usr/local/bin/node" "/usr/local/bin/npm" "run" "marionette" "--" "--buildapp=desktop" "--reporter=mocha-tbpl-reporter" "--marionette-capabilities=/home/worker/gaia/tests/jsmarionette/capabilities.json"

 07:16:39     INFO -  npm ERR! node v4.2.2

 07:16:39     INFO -  npm ERR! npm  v2.14.7

 07:16:39     INFO -  npm ERR! code ELIFECYCLE

 07:16:39     INFO -  npm ERR! gaia@0.0.3 marionette: `gaia-marionette "--buildapp=desktop" "--reporter=mocha-tbpl-reporter" "--marionette-capabilities=/home/worker/gaia/tests/jsmarionette/capabilities.json"`

 07:16:39     INFO -  npm ERR! Exit status 1

 07:16:39     INFO -  npm ERR!

 07:16:39     INFO -  npm ERR! Failed at the gaia@0.0.3 marionette script 'gaia-marionette "--buildapp=desktop" "--reporter=mocha-tbpl-reporter" "--marionette-capabilities=/home/worker/gaia/tests/jsmarionette/capabilities.json"'.

 07:16:39     INFO -  npm ERR! This is most likely a problem with the gaia package,

 07:16:39     INFO -  npm ERR! not with npm itself.

 07:16:39     INFO -  npm ERR! Tell the author that this fails on your system:

 07:16:39     INFO -  npm ERR!     gaia-marionette "--buildapp=desktop" "--reporter=mocha-tbpl-reporter" "--marionette-capabilities=/home/worker/gaia/tests/jsmarionette/capabilities.json"

 07:16:39     INFO -  npm ERR! You can get their info via:

 07:16:39     INFO -  npm ERR!     npm owner ls gaia

 07:16:39     INFO -  npm ERR! There is likely additional logging output above.

 07:16:39     INFO -  npm ERR! Please include the following file with any support request:

 07:16:39     INFO -  npm ERR!     /home/worker/gaia/npm-debug.log

 07:16:39     INFO -  make: *** [test-integration-test] Error 1

 07:16:39    ERROR - Return code: 2

 07:16:39     INFO - TinderboxPrint: gaia-integration-tests: 26/<em class="testfail">1</em>/0

 07:16:39    ERROR - Tests exited with return code 2: harness failures

 07:16:39    ERROR - # TBPL FAILURE #

Comment 1

2 years ago
5 automation job failures were associated with this bug in the last 7 days.

Repository breakdown:
* mozilla-inbound: 5

Platform breakdown:
* mulet-linux64: 4
* b2g-linux64: 1

For more details, see:
https://brasstacks.mozilla.com/orangefactor/?display=Bug&bugid=1236444&startday=2016-01-04&endday=2016-01-10&tree=all

Comment 2

9 months ago
Closing all intermittent test failures for Firefox OS (since we're not focusing on it anymore).

Please reopen if my search included your bug by mistake.
You need to log in before you can comment on or make changes to this bug.