Closed Bug 1256004 Opened 4 years ago Closed 3 years ago

Frequent TaskCluster build gmake[5]: *** [/home/worker/workspace/build/src/obj-firefox/addon-sdk/source/test/addons/.mkdir.done] Error 1

Categories

(Firefox Build System :: General, defect)

Unspecified
Linux
defect
Not set

Tracking

(firefox48 wontfix, firefox49 wontfix, firefox50 wontfix, firefox51 fixed)

RESOLVED FIXED
mozilla51
Tracking Status
firefox48 --- wontfix
firefox49 --- wontfix
firefox50 --- wontfix
firefox51 --- fixed

People

(Reporter: RyanVM, Assigned: glandium)

References

Details

(Keywords: intermittent-failure)

Attachments

(1 file)

This is quite frequent, please investigate soon.

https://treeherder.mozilla.org/logviewer.html#?job_id=23611221&repo=mozilla-inbound

02:20:58     INFO -  gmake[5]: Entering directory `/home/worker/workspace/build/src/obj-firefox/addon-sdk'
02:20:58     INFO -  mkdir -p '/home/worker/workspace/build/src/obj-firefox/addon-sdk/source/test/addons/'
02:20:58     INFO -  mkdir: cannot create directory `/home/worker/workspace/build/src/obj-firefox/addon-sdk/source/test/addons/': No such file or directory
02:20:58     INFO -  gmake[5]: *** [/home/worker/workspace/build/src/obj-firefox/addon-sdk/source/test/addons/.mkdir.done] Error 1
02:20:58     INFO -  gmake[5]: Leaving directory `/home/worker/workspace/build/src/obj-firefox/addon-sdk'
02:20:58     INFO -  gmake[4]: *** [addon-sdk/misc] Error 2
Flags: needinfo?(cmanchester)
When I looked in to this earlier in the week, the failure rate was something like 5%. The error is the same apparent problem as bug 1208729, which was blamed on (TC) infra, but perhaps erroneously (see https://bugzilla.mozilla.org/show_bug.cgi?id=1208729#c54).
Flags: needinfo?(cmanchester)
It's likely a problem with aufs, used by docker on TC.
I also see this a lot in my (non-artifact) TC pushes.  We already use $(MKDIR) rather than `mkdir` most places; I wonder if we could make this more robust by retrying?
Looking at orange factor, this is happening on a number of TaskCluster based builds on try as well. Re-summarizing to match.
Summary: Frequent artifact build gmake[5]: *** [/home/worker/workspace/build/src/obj-firefox/addon-sdk/source/test/addons/.mkdir.done] Error 1 → Frequent TaskCluster build gmake[5]: *** [/home/worker/workspace/build/src/obj-firefox/addon-sdk/source/test/addons/.mkdir.done] Error 1
Depends on: 1240676
No longer depends on: 1240676
Assignee: nobody → mh+mozilla
Comment on attachment 8780406 [details]
Bug 1256004 - Create the addon-sdk test addons directly under addon-sdk.

https://reviewboard.mozilla.org/r/71144/#review68906
Attachment #8780406 - Flags: review?(gps) → review+
Pushed by mh@glandium.org:
https://hg.mozilla.org/integration/mozilla-inbound/rev/5dd2ba45526f
Create the addon-sdk test addons directly under addon-sdk. r=gps
https://hg.mozilla.org/mozilla-central/rev/5dd2ba45526f
Status: NEW → RESOLVED
Closed: 3 years ago
Resolution: --- → FIXED
Target Milestone: --- → mozilla51
Mike, is this something you would like to uplift to aurora & beta? thanks
Flags: needinfo?(mh+mozilla)
OrangeFactor is not mentioning beta or aurora, is it hurting there?
Flags: needinfo?(mh+mozilla)
Product: Core → Firefox Build System
You need to log in before you can comment on or make changes to this bug.