Closed Bug 12789 Opened 20 years ago Closed 20 years ago

Build fails under Solaris v2.6 - nsinstall returns usage message

Categories

(NSPR :: NSPR, defect, P3, major)

Sun
Solaris

Tracking

(Not tracked)

RESOLVED WORKSFORME

People

(Reporter: minfrin, Assigned: srinivas)

Details

The M9 Mozilla build fails under Solaris v2.6 - nsinstall returns a usage
message like so:

cd private; make export
make[4]: Entering directory
`/home/infobase/dsngrle/tmp/mozilla/nsprpub/pr/include/private'
../../../config/SunOS5.6_sparc_gcc_PTH_OPT.OBJ/nsinstall -R -m 444 pprio.h
pprthred.h prpriv.h /home/infobase/dsngrle/tmp/mozilla/dist/include/private
make[4]: Leaving directory
`/home/infobase/dsngrle/tmp/mozilla/nsprpub/pr/include/private'
cd obsolete; make export
make[4]: Entering directory
`/home/infobase/dsngrle/tmp/mozilla/nsprpub/pr/include/obsolete'
../../../config/SunOS5.6_sparc_gcc_PTH_OPT.OBJ/nsinstall -R -m 444
/home/infobase/dsngrle/tmp/mozilla/dist/include/obsolete
usage: ../../../config/SunOS5.6_sparc_gcc_PTH_OPT.OBJ/nsinstall [-C cwd] [-L
linkprefix] [-m mode] [-o owner] [-g group]
                                                                [-DdltR] file
[file ...] directory
make[4]: *** [export] Error 2
make[4]: Leaving directory
`/home/infobase/dsngrle/tmp/mozilla/nsprpub/pr/include/obsolete'
make[3]: *** [export] Error 2
make[3]: Leaving directory
`/home/infobase/dsngrle/tmp/mozilla/nsprpub/pr/include'
make[2]: *** [export] Error 2
make[2]: Leaving directory `/home/infobase/dsngrle/tmp/mozilla/nsprpub/pr'
make[1]: *** [export] Error 2
make[1]: Leaving directory `/home/infobase/dsngrle/tmp/mozilla/nsprpub'
make: *** [export] Error 2
Assignee: briano → srinivas
Component: Build Config → NSPR
Product: Browser → NSPR
Version: other → 3.5
I'm not seeing this in my Tinderbox builds, but I build nsprpub separately.
Reassigning to Srinivas, since this is an NSPR issue.
Target Milestone: M1
I build on 2.6 almost every day, I build
nspr as part of the build (the default),
I don't see this.
Status: NEW → RESOLVED
Closed: 20 years ago
Resolution: --- → WORKSFORME
Target Milestone: M1 → M9
Marking Verified/WorksForMe.  Please reopen if still a problem.
Target Milestone: M9 → ---
You need to log in before you can comment on or make changes to this bug.