All users were logged out of Bugzilla on October 13th, 2018

mailnews/base/util/nsMsgProtocol.cpp : error: ignoring return value of function declared : pipe->GetOutputStream(&outputStream);

RESOLVED DUPLICATE of bug 1297133

Status

RESOLVED DUPLICATE of bug 1297133
2 years ago
2 years ago

People

(Reporter: ewong, Unassigned)

Tracking

Firefox Tracking Flags

(Not tracked)

Details

(Reporter)

Description

2 years ago
bustage:

/builds/slave/c-cen-t-osx64/build/clang/bin/clang++ -arch x86_64 -std=gnu++11 -o nsEncryptedSMIMEURIsService.o -c  -fvisibility=hidden -fvisibility-inlines-hidden -DNDEBUG=1 -DTRIMMED=1 -DSTATIC_EXPORTABLE_JS_API -DMOZILLA_INTERNAL_API -DIMPL_LIBXUL -I/builds/slave/c-cen-t-osx64/build/mailnews/extensions/smime/src -I/builds/slave/c-cen-t-osx64/build/objdir/x86_64/mailnews/extensions/smime/src -I/builds/slave/c-cen-t-osx64/build/mozilla/security/pkix/include -I/builds/slave/c-cen-t-osx64/build/objdir/x86_64/dist/include  -I/builds/slave/c-cen-t-osx64/build/objdir/x86_64/dist/include/nspr -I/builds/slave/c-cen-t-osx64/build/objdir/x86_64/dist/include/nss       -fPIC  -DMOZILLA_CLIENT -include /builds/slave/c-cen-t-osx64/build/objdir/x86_64/mozilla-config.h -MD -MP -MF .deps/nsEncryptedSMIMEURIsService.o.pp -Qunused-arguments  -Qunused-arguments -Wall -Wc++11-compat -Wempty-body -Wignored-qualifiers -Woverloaded-virtual -Wpointer-arith -Wsign-compare -Wtype-limits -Wunreachable-code -Wwrite-strings -Wno-invalid-offsetof -Wclass-varargs -Wloop-analysis -Wc++11-compat-pedantic -Wc++14-compat -Wc++14-compat-pedantic -Wc++1z-compat -Wimplicit-fallthrough -Werror=non-literal-null-conversion -Wstring-conversion -Wthread-safety -Wno-inline-new-delete -Wno-error=deprecated-declarations -Wno-error=array-bounds -Wno-unknown-warning-option -Wno-return-type-c-linkage -gdwarf-2 -isysroot /Developer/SDKs/MacOSX10.7.sdk -fno-exceptions -fno-strict-aliasing -stdlib=libc++ -fno-rtti -ffunction-sections -fdata-sections -fno-exceptions -fno-math-errno -pthread -pipe  -gdwarf-2 -O3 -fno-omit-frame-pointer  -Werror   /builds/slave/c-cen-t-osx64/build/mailnews/extensions/smime/src/nsEncryptedSMIMEURIsService.cpp
/builds/slave/c-cen-t-osx64/build/clang/bin/clang++ -arch x86_64 -std=gnu++11 -o nsMsgComposeSecure.o -c  -fvisibility=hidden -fvisibility-inlines-hidden -DNDEBUG=1 -DTRIMMED=1 -DSTATIC_EXPORTABLE_JS_API -DMOZILLA_INTERNAL_API -DIMPL_LIBXUL -I/builds/slave/c-cen-t-osx64/build/mailnews/extensions/smime/src -I/builds/slave/c-cen-t-osx64/build/objdir/x86_64/mailnews/extensions/smime/src -I/builds/slave/c-cen-t-osx64/build/mozilla/security/pkix/include -I/builds/slave/c-cen-t-osx64/build/objdir/x86_64/dist/include  -I/builds/slave/c-cen-t-osx64/build/objdir/x86_64/dist/include/nspr -I/builds/slave/c-cen-t-osx64/build/objdir/x86_64/dist/include/nss       -fPIC  -DMOZILLA_CLIENT -include /builds/slave/c-cen-t-osx64/build/objdir/x86_64/mozilla-config.h -MD -MP -MF .deps/nsMsgComposeSecure.o.pp -Qunused-arguments  -Qunused-arguments -Wall -Wc++11-compat -Wempty-body -Wignored-qualifiers -Woverloaded-virtual -Wpointer-arith -Wsign-compare -Wtype-limits -Wunreachable-code -Wwrite-strings -Wno-invalid-offsetof -Wclass-varargs -Wloop-analysis -Wc++11-compat-pedantic -Wc++14-compat -Wc++14-compat-pedantic -Wc++1z-compat -Wimplicit-fallthrough -Werror=non-literal-null-conversion -Wstring-conversion -Wthread-safety -Wno-inline-new-delete -Wno-error=deprecated-declarations -Wno-error=array-bounds -Wno-unknown-warning-option -Wno-return-type-c-linkage -gdwarf-2 -isysroot /Developer/SDKs/MacOSX10.7.sdk -fno-exceptions -fno-strict-aliasing -stdlib=libc++ -fno-rtti -ffunction-sections -fdata-sections -fno-exceptions -fno-math-errno -pthread -pipe  -gdwarf-2 -O3 -fno-omit-frame-pointer  -Werror   /builds/slave/c-cen-t-osx64/build/mailnews/extensions/smime/src/nsMsgComposeSecure.cpp
/builds/slave/c-cen-t-osx64/build/clang/bin/clang++ -arch x86_64 -std=gnu++11 -o nsMsgProtocol.o -c  -fvisibility=hidden -fvisibility-inlines-hidden -DNDEBUG=1 -DTRIMMED=1 -D_IMPL_NS_MSG_BASE -DSTATIC_EXPORTABLE_JS_API -DMOZILLA_INTERNAL_API -DIMPL_LIBXUL -I/builds/slave/c-cen-t-osx64/build/mailnews/base/util -I/builds/slave/c-cen-t-osx64/build/objdir/x86_64/mailnews/base/util -I/builds/slave/c-cen-t-osx64/build/mozilla/netwerk/base -I/builds/slave/c-cen-t-osx64/build/objdir/x86_64/dist/include  -I/builds/slave/c-cen-t-osx64/build/objdir/x86_64/dist/include/nspr -I/builds/slave/c-cen-t-osx64/build/objdir/x86_64/dist/include/nss       -fPIC  -DMOZILLA_CLIENT -include /builds/slave/c-cen-t-osx64/build/objdir/x86_64/mozilla-config.h -MD -MP -MF .deps/nsMsgProtocol.o.pp -Qunused-arguments  -Qunused-arguments -Wall -Wc++11-compat -Wempty-body -Wignored-qualifiers -Woverloaded-virtual -Wpointer-arith -Wsign-compare -Wtype-limits -Wunreachable-code -Wwrite-strings -Wno-invalid-offsetof -Wclass-varargs -Wloop-analysis -Wc++11-compat-pedantic -Wc++14-compat -Wc++14-compat-pedantic -Wc++1z-compat -Wimplicit-fallthrough -Werror=non-literal-null-conversion -Wstring-conversion -Wthread-safety -Wno-inline-new-delete -Wno-error=deprecated-declarations -Wno-error=array-bounds -Wno-unknown-warning-option -Wno-return-type-c-linkage -gdwarf-2 -isysroot /Developer/SDKs/MacOSX10.7.sdk -fno-exceptions -fno-strict-aliasing -stdlib=libc++ -fno-rtti -ffunction-sections -fdata-sections -fno-exceptions -fno-math-errno -pthread -pipe  -gdwarf-2 -O3 -fno-omit-frame-pointer  -Werror   /builds/slave/c-cen-t-osx64/build/mailnews/base/util/nsMsgProtocol.cpp
/builds/slave/c-cen-t-osx64/build/mailnews/base/util/nsMsgProtocol.cpp:1423:5: error: ignoring return value of function declared with warn_unused_result attribute [-Werror,-Wunused-result]
    pipe->GetInputStream(&inputStream);
    ^~~~~~~~~~~~~~~~~~~~ ~~~~~~~~~~~~
/builds/slave/c-cen-t-osx64/build/mailnews/base/util/nsMsgProtocol.cpp:1427:5: error: ignoring return value of function declared with warn_unused_result attribute [-Werror,-Wunused-result]
    pipe->GetOutputStream(&outputStream);
    ^~~~~~~~~~~~~~~~~~~~~ ~~~~~~~~~~~~~
2 errors generated.
make[5]: *** [nsMsgProtocol.o] Error 1
make[4]: *** [mailnews/base/util/target] Error 2
make[4]: *** Waiting for unfinished jobs....
(Reporter)

Updated

2 years ago
Status: NEW → RESOLVED
Last Resolved: 2 years ago
Resolution: --- → DUPLICATE
Duplicate of bug: 1297133
6 automation job failures were associated with this bug in the last 7 days.

Repository breakdown:
* comm-central: 6

Platform breakdown:
* osx-10-7: 2
* linux64: 2
* linux32: 2

For more details, see:
https://brasstacks.mozilla.com/orangefactor/?display=Bug&bugid=1297242&startday=2016-08-22&endday=2016-08-28&tree=all
You need to log in before you can comment on or make changes to this bug.