Closed Bug 1301598 Opened 3 years ago Closed 3 years ago

Intermittent test_ssl_disabled_error_page.py TestSSLDisabledErrorPage.test_ssl_disabled_error_page | TimeoutException: Timed out after 5.0 seconds

Categories

(Testing :: Firefox UI Tests, defect)

Version 3
defect
Not set

Tracking

(firefox50 fixed, firefox51 fixed)

RESOLVED FIXED
mozilla51
Tracking Status
firefox50 --- fixed
firefox51 --- fixed

People

(Reporter: intermittent-bug-filer, Assigned: whimboo)

Details

(Keywords: intermittent-failure)

Attachments

(1 file)

03:18:11     INFO - TEST-UNEXPECTED-ERROR | test_ssl_disabled_error_page.py TestSSLDisabledErrorPage.test_ssl_disabled_error_page | TimeoutException: Timed out after 5.0 seconds
03:18:11     INFO - Traceback (most recent call last):
03:18:11     INFO -   File "/home/worker/workspace/build/venv/local/lib/python2.7/site-packages/marionette/marionette_test.py", line 365, in run
03:18:11     INFO -     testMethod()
03:18:11     INFO -   File "/home/worker/workspace/build/tests/firefox-ui/tests/functional/security/test_ssl_disabled_error_page.py", line 53, in test_ssl_disabled_error_page
03:18:11     INFO -     'http://quality.mozilla.org'))
03:18:11     INFO -   File "/home/worker/workspace/build/venv/local/lib/python2.7/site-packages/marionette_driver/wait.py", line 151, in until
03:18:11     INFO -     cause=last_exc)

https://dxr.mozilla.org/mozilla-central/rev/938ce16be25f9c551c19ef8938e8717ed3d41ff5/testing/firefox-ui/tests/functional/security/test_ssl_disabled_error_page.py#52

Maybe the page load is kinda slow, and I see that we only wait 5s, instead of 30. We should bump up the timeout for Wait() adequately.
Assignee: nobody → hskupin
Comment on attachment 8789693 [details]
Bug 1301598 - Fix test_ssl_disabled_error_page.py to timeout after 30s for the page load

https://reviewboard.mozilla.org/r/77828/#review76274
Attachment #8789693 - Flags: review?(mjzffr) → review+
Pushed by hskupin@mozilla.com:
https://hg.mozilla.org/integration/autoland/rev/91f2632c7628
Fix test_ssl_disabled_error_page.py to timeout after 30s for the page load r=maja_zf
https://hg.mozilla.org/mozilla-central/rev/91f2632c7628
Status: NEW → RESOLVED
Closed: 3 years ago
Resolution: --- → FIXED
Target Milestone: --- → mozilla51
test-only fix which can help to keep test failures low for the next beta in case of networking issues. Please uplift to mozilla-aurora.
Whiteboard: [checkin-needed-aurora]
Whiteboard: [checkin-needed-aurora]
You need to log in before you can comment on or make changes to this bug.