fatal error in dom/encoding/Unified_cpp_dom_encoding0.cpp: nsUConvPropertySearch.h: File or directory does not exist

RESOLVED FIXED in Firefox 52

Status

()

Core
DOM
RESOLVED FIXED
2 years ago
a year ago

People

(Reporter: aceman, Assigned: aceman)

Tracking

Trunk
mozilla52
x86
Linux
Points:
---

Firefox Tracking Flags

(firefox52 fixed)

Details

Attachments

(1 attachment)

(Assignee)

Description

2 years ago
I get the following compile error for a long time already:

In file included from dom/encoding/Unified_cpp_dom_encoding0.cpp:2:0:
dom/encoding/EncodingUtils.cpp:10:35: fatal error: nsUConvPropertySearch.h: File or directory does not exist.
compilation terminated.
gmake[4]: *** [Unified_cpp_dom_encoding0.o] Error 1
gmake[3]: *** [dom/encoding/target] Error 2
gmake[3]: *** Waiting for unfinished jobs....
gmake[2]: *** [compile] Error 2
gmake[1]: *** [default] Error 2
(Assignee)

Comment 1

2 years ago
Created attachment 8792147 [details] [diff] [review]
patch

This change fixes it, however I am not sure if it is the correct way.
Attachment #8792147 - Flags: review?(hsivonen)
Comment on attachment 8792147 [details] [diff] [review]
patch

I find it odd that anyone has been able to build without this, but it indeed seems that this should be done.
Attachment #8792147 - Flags: review?(hsivonen) → review+
(Assignee)

Comment 3

a year ago
Thanks.
I disable some stuff in my build (using the standard supplied mozconfig options). So maybe this header is pulled in by some unrelated module, that I have disabled.
Keywords: checkin-needed
OS: Unspecified → Linux
Hardware: Unspecified → x86
Version: unspecified → Trunk

Comment 4

a year ago
Pushed by ryanvm@gmail.com:
https://hg.mozilla.org/integration/mozilla-inbound/rev/fc2edbb6fa21
Export nsUConvPropertySearch.h so it can be found for dom/encoding/Unified_cpp_dom_encoding0.cpp. r=hsivonen
Keywords: checkin-needed

Comment 5

a year ago
bugherder
https://hg.mozilla.org/mozilla-central/rev/fc2edbb6fa21
Status: ASSIGNED → RESOLVED
Last Resolved: a year ago
status-firefox52: --- → fixed
Resolution: --- → FIXED
Target Milestone: --- → mozilla52
You need to log in before you can comment on or make changes to this bug.