Fix path to nss-purple.symbols now NSS is built with gyp

RESOLVED FIXED in Instantbird 53

Status

defect
RESOLVED FIXED
3 years ago
3 years ago

People

(Reporter: arlolra, Assigned: arlolra)

Tracking

trunk
Instantbird 53

Details

Attachments

(1 attachment)

Assignee

Description

3 years ago
User Agent: Mozilla/5.0 (Macintosh; Intel Mac OS X 10_12_1) AppleWebKit/537.36 (KHTML, like Gecko) Chrome/54.0.2840.98 Safari/537.36
Assignee

Updated

3 years ago
Attachment #8812457 - Attachment is patch: true
Attachment #8812457 - Attachment mime type: text/x-patch → text/plain

Comment 1

3 years ago
A bit more context would have been helpful ;)

Traceback (most recent call last):
  File "/usr/local/Cellar/python/2.7.11/Frameworks/Python.framework/Versions/2.7/lib/python2.7/runpy.py", line 162, in _run_module_as_main
    "__main__", fname, loader, pkg_name)
  File "/usr/local/Cellar/python/2.7.11/Frameworks/Python.framework/Versions/2.7/lib/python2.7/runpy.py", line 72, in _run_code
    exec code in run_globals
  File "/Users/buildbot/buildslave/macosx/build/mozilla/python/mozbuild/mozbuild/action/file_generate.py", line 108, in <module>
    sys.exit(main(sys.argv[1:]))
  File "/Users/buildbot/buildslave/macosx/build/mozilla/python/mozbuild/mozbuild/action/file_generate.py", line 63, in main
    ret = module.__dict__[method](output, *args.additional_arguments)
  File "/Users/buildbot/buildslave/macosx/build/mozilla/python/mozbuild/mozbuild/action/generate_symbols_file.py", line 41, in generate_symbols_file
    pp.do_include(input)
  File "/Users/buildbot/buildslave/macosx/build/mozilla/python/mozbuild/mozbuild/preprocessor.py", line 776, in do_include
    self.handleLine(l)
  File "/Users/buildbot/buildslave/macosx/build/mozilla/python/mozbuild/mozbuild/preprocessor.py", line 550, in handleLine
    cmd(args)
  File "/Users/buildbot/buildslave/macosx/build/mozilla/python/mozbuild/mozbuild/preprocessor.py", line 756, in do_include
    raise Preprocessor.Error(self, 'FILE_NOT_FOUND', str(args))
mozbuild.preprocessor.Error: ('/Users/buildbot/buildslave/macosx/build/mozilla/security/nss.symbols', 721, 'FILE_NOT_FOUND', '/Users/buildbot/buildslave/macosx/build/mozilla/security/../../../../chat/nss-purple.symbols')
make[5]: *** [libnss3.dylib.symbols] Error 1
make[5]: *** Deleting file `libnss3.dylib.symbols'
make[4]: *** [security/target] Error 2
Status: UNCONFIRMED → NEW
Ever confirmed: true
Summary: Fix build → Fix path to nss-purple.symbols now NSS is built with gyp

Comment 3

3 years ago
Thanks!
Assignee: nobody → arlolra
Status: NEW → RESOLVED
Closed: 3 years ago
Resolution: --- → FIXED
Target Milestone: --- → Instantbird 53

Updated

3 years ago
Attachment #8812457 - Flags: review+
You need to log in before you can comment on or make changes to this bug.