Clobber needed after bug 1353295 was backed out

RESOLVED INCOMPLETE

Status

()

Core
Build Config
RESOLVED INCOMPLETE
8 months ago
8 months ago

People

(Reporter: Tomcat, Unassigned)

Tracking

Firefox Tracking Flags

(Not tracked)

Details

(URL)

(Reporter)

Description

8 months ago
bug 1353295 was backed out for assertion failures on m-c and that worked like expected and without conflicts or anything.

However after backout we had a build bustage like 

backend.mk:37: recipe for target 'TelemetryScalarData.h' failed
[task 2017-04-13T07:46:48.912099Z] 07:46:48     INFO -  gmake[5]: *** [TelemetryScalarData.h] Segmentation fault (core dumped)
[task 2017-04-13T07:46:48.912255Z] 07:46:48     INFO -  gmake[5]: *** Waiting for unfinished jobs....
[task 2017-04-13T07:46:48.979973Z] 07:46:48     INFO -  ../../config/nsinstall -R -m 644 'xpcAccEvents.h' '../../dist/include'
[task 2017-04-13T07:46:48.980170Z] 07:46:48     INFO -  gmake[5]: Leaving directory '/home/worker/workspace/build/src/obj-firefox/accessible/xpcom'
[task 2017-04-13T07:46:49.076312Z] 07:46:49     INFO -  gmake[5]: Leaving directory '/home/worker/workspace/build/src/obj-firefox/toolkit/components/telemetry'
[task 2017-04-13T07:46:49.076483Z] 07:46:49     INFO -  /home/worker/workspace/build/src/config/recurse.mk:100: recipe for target 'toolkit/components/telemetry/export' failed
[task 2017-04-13T07:46:49.076620Z] 07:46:49     INFO -  gmake[4]: *** [toolkit/components/telemetry/export] Error 2
[task 2017-04-13T07:46:49.076780Z] 07:46:49     INFO -  gmake[4]: *** Waiting for unfinished jobs....
[task 2017-04-13T07:47:04.231219Z] 07:47:04     INFO -  Generating /home/worker/workspace/build/src/obj-firefox/dom/bindings/TestExampleWorkerInterface-example.h
[task 2017-04-13T07:47:04.231397Z] 07:47:04     INFO -  Generating /home/worker/workspace/build/src/obj-firefox/dom/bindings/TestExampleWorkerInterface-example.cpp
[task 2017-04-13T07:47:04.231539Z] 07:47:04     INFO -  Generating /home/worker/workspace/build/src/obj-firefox/dom/bindings/TestExampleProxyInterface-example.h
[task 2017-04-13T07:47:04.231697Z] 07:47:04     INFO -  Generating /home/worker/workspace/build/src/obj-firefox/dom/bindings/TestExampleProxyInterface-example.cpp
[task 2017-04-13T07:47:04.231862Z] 07:47:04     INFO -  Generating /home/worker/workspace/build/src/obj-firefox/dom/bindings/TestExampleInterface-example.h
[task 2017-04-13T07:47:04.232038Z] 07:47:04     INFO -  Generating /home/worker/workspace/build/src/obj-firefox/dom/bindings/TestExampleInterface-example.cpp
[task 2017-04-13T07:47:04.392940Z] 07:47:04     INFO -  gmake[5]: Nothing to be done for 'export'.
[task 2017-04-13T07:47:04.393215Z] 07:47:04     INFO -  gmake[5]: Leaving directory '/home/worker/workspace/build/src/obj-firefox/dom/bindings'
[task 2017-04-13T07:47:06.206482Z] 07:47:06     INFO -  gmake[5]: Leaving directory '/home/worker/workspace/build/src/obj-firefox/ipc/ipdl'
[task 2017-04-13T07:47:06.206699Z] 07:47:06     INFO -  gmake[4]: Leaving directory '/home/worker/workspace/build/src/obj-firefox'
[task 2017-04-13T07:47:06.206865Z] 07:47:06     INFO -  /home/worker/workspace/build/src/config/recurse.mk:32: recipe for target 'export' failed
[task 2017-04-13T07:47:06.207021Z] 07:47:06     INFO -  gmake[3]: *** [export] Error 2
[task 2017-04-13T07:47:06.207176Z] 07:47:06     INFO -  gmake[3]: Leaving directory '/home/worker/workspace/build/src/obj-firefox'
[task 2017-04-13T07:47:06.207331Z] 07:47:06     INFO -  /home/worker/workspace/build/src/config/rules.mk:519: recipe for target 'default' failed
[task 2017-04-13T07:47:06.207474Z] 07:47:06     INFO -  gmake[2]: *** [default] Error 2
[task 2017-04-13T07:47:06.207642Z] 07:47:06     INFO -  gmake[2]: Leaving directory '/home/worker/workspace/build/src/obj-firefox'
[task 2017-04-13T07:47:06.207800Z] 07:47:06     INFO -  /home/worker/workspace/build/src/client.mk:419: recipe for target 'realbuild' failed
[task 2017-04-13T07:47:06.207946Z] 07:47:06     INFO -  gmake[1]: *** [realbuild] Error 2
[task 2017-04-13T07:47:06.208095Z] 07:47:06     INFO -  gmake[1]: Leaving directory '/home/worker/workspace/build/src'
[task 2017-04-13T07:47:06.208232Z] 07:47:06     INFO -  client.mk:170: recipe for target 'build' failed
[task 2017-04-13T07:47:06.208369Z] 07:47:06     INFO -  gmake: *** [build] Error 2
[task 2017-04-13T07:47:06.213251Z] 07:47:06     INFO -  0 compiler warnings present.

so touching clobber now

Comment 1

8 months ago
Pushed by cbook@mozilla.com:
https://hg.mozilla.org/mozilla-central/rev/819a666afddc
Clobber needed after bug 1353295 was backed out a=sheriffduty
[task 2017-04-13T07:46:48.912099Z] 07:46:48     INFO -  gmake[5]: *** [TelemetryScalarData.h] Segmentation fault (core dumped)

This tells me this has nothing to do with a clobber. In fact a retrigger should work just as much. And all bets are off as to what happened. Especially considering what builds the file is a python script... IOW, there's nothing we can really do with this report, unfortunately.
Status: NEW → RESOLVED
Last Resolved: 8 months ago
Resolution: --- → INCOMPLETE
You need to log in before you can comment on or make changes to this bug.