If you think a bug might affect users in the 57 release, please set the correct tracking and status flags for Release Management.

Fix geckodriver build on macOS

NEW
Unassigned

Status

Testing
Marionette
P3
normal
4 months ago
4 days ago

People

(Reporter: ato, Unassigned)

Tracking

Version 3
x86_64
Mac OS X
Points:
---

Firefox Tracking Flags

(Not tracked)

Details

(Reporter)

Description

4 months ago
Fails with the following error:

[task 2017-05-24T19:13:19.772958Z] 19:13:19     INFO -  /home/worker/workspace/build/src/sccache2/sccache /home/worker/workspace/build/src/clang/bin/clang++ -target x86_64-apple-darwin11 -B /home/worker/workspace/build/src/cctools/bin -isysroot /home/worker/workspace/build/src/MacOSX10.7.sdk -std=gnu++11 -o Unified_cpp_dom_xhr0.o -c  -fvisibility=hidden -fvisibility-inlines-hidden -DDEBUG=1 -DOS_POSIX=1 -DOS_MACOSX=1 -DSTATIC_EXPORTABLE_JS_API -DMOZ_HAS_MOZGLUE -DMOZILLA_INTERNAL_API -DIMPL_LIBXUL -I/home/worker/workspace/build/src/dom/xhr -I/home/worker/workspace/build/src/obj-firefox/dom/xhr -I/home/worker/workspace/build/src/dom/base -I/home/worker/workspace/build/src/dom/file -I/home/worker/workspace/build/src/dom/workers -I/home/worker/workspace/build/src/netwerk/base -I/home/worker/workspace/build/src/obj-firefox/ipc/ipdl/_ipdlheaders -I/home/worker/workspace/build/src/ipc/chromium/src -I/home/worker/workspace/build/src/ipc/glue -I/home/worker/workspace/build/src/obj-firefox/dist/include  -I/home/worker/workspace/build/src/obj-firefox/dist/include/nspr -I/home/worker/workspace/build/src/obj-firefox/dist/include/nss       -fPIC  -DMOZILLA_CLIENT -include /home/worker/workspace/build/src/obj-firefox/mozilla-config.h -MD -MP -MF .deps/Unified_cpp_dom_xhr0.o.pp -Qunused-arguments   -Qunused-arguments -Wall -Wc++11-compat -Wempty-body -Wignored-qualifiers -Woverloaded-virtual -Wpointer-arith -Wsign-compare -Wtype-limits -Wunreachable-code -Wwrite-strings -Wno-invalid-offsetof -Wclass-varargs -Wloop-analysis -Wc++11-compat-pedantic -Wc++14-compat -Wc++14-compat-pedantic -Wc++1z-compat -Wcomma -Wimplicit-fallthrough -Werror=non-literal-null-conversion -Wstring-conversion -Wno-inline-new-delete -Wno-error=deprecated-declarations -Wno-error=array-bounds -Wformat -Wno-gnu-zero-variadic-macro-arguments -Wno-unknown-warning-option -Wno-return-type-c-linkage -fno-exceptions -fno-strict-aliasing -stdlib=libc++ -fno-rtti -ffunction-sections -fdata-sections -fno-exceptions -fno-math-errno -pthread -pipe  -g -Xclang -load -Xclang /home/worker/workspace/build/src/obj-firefox/build/clang-plugin/libclang-plugin.dylib -Xclang -add-plugin -Xclang moz-check -O3 -fno-omit-frame-pointer  -Werror   /home/worker/workspace/build/src/obj-firefox/dom/xhr/Unified_cpp_dom_xhr0.cpp
[task 2017-05-24T19:13:19.778033Z] 19:13:19     INFO -  error: linking with `/home/worker/workspace/build/src/build/cargo-linker` failed: exit code: 1
[task 2017-05-24T19:13:19.778517Z] 19:13:19     INFO -    |
[task 2017-05-24T19:13:19.807215Z] 19:13:19     INFO -    = note: "/home/worker/workspace/build/src/build/cargo-linker" "-m64" "-L" "/home/worker/workspace/build/src/rustc/lib/rustlib/x86_64-apple-darwin/lib" "/home/worker/workspace/build/src/obj-firefox/testing/geckodriver/./x86_64-apple-darwin/debug/deps/geckodriver-387c8adb9ddc9744.0.o" "-o" "/home/worker/workspace/build/src/obj-firefox/testing/geckodriver/./x86_64-apple-darwin/debug/deps/geckodriver-387c8adb9ddc9744" "-Wl,-dead_strip" "-nodefaultlibs" "-L" "/home/worker/workspace/build/src/obj-firefox/testing/geckodriver/./x86_64-apple-darwin/debug/deps" "-L" "/home/worker/workspace/build/src/obj-firefox/testing/geckodriver/./debug/deps" "-L" "/home/worker/workspace/build/src/obj-firefox/testing/geckodriver/./x86_64-apple-darwin/debug/build/bzip2-sys-757da42682099d9d/out" "-L" "/home/worker/workspace/build/src/obj-firefox/testing/geckodriver/./x86_64-apple-darwin/debug/build/miniz-sys-07cc64aa136ffbd3/out" "-L" "/home/worker/workspace/build/src/rustc/lib/rustlib/x86_64-apple-darwin/lib" "/home/worker/workspace/build/src/obj-firefox/testing/geckodriver/x86_64-apple-darwin/debug/deps/libmozversion-d92b828eab08e68a.rlib" "/home/worker/workspace/build/src/obj-firefox/testing/geckodriver/x86_64-apple-darwin/debug/deps/libini-e8a5f3dae0ebefb7.rlib" "/home/worker/workspace/build/src/obj-firefox/testing/geckodriver/x86_64-apple-darwin/debug/deps/libwebdriver-997383d7dc776fdb.rlib" "/home/worker/workspace/build/src/obj-firefox/testing/geckodriver/x86_64-apple-darwin/debug/deps/librustc_serialize-2f01b5d382e94952.rlib" "/home/worker/workspace/build/src/obj-firefox/testing/geckodriver/x86_64-apple-darwin/debug/deps/libbacktrace-69529d57451f2e9c.rlib" "/home/worker/workspace/build/src/obj-firefox/testing/geckodriver/x86_64-apple-darwin/debug/deps/libcfg_if-f4039f90f22bcb1e.rlib" "/home/worker/workspace/build/src/obj-firefox/testing/geckodriver/x86_64-apple-darwin/debug/deps/libmozrunner-73ec0efab473f00a.rlib" "/home/worker/workspace/build/src/obj-firefox/testing/geckodriver/x86_64-apple-darwin/debug/deps/libsemver-70b59fcc83de19e2.rlib" "/home/worker/workspace/build/src/obj-firefox/testing/geckodriver/x86_64-apple-darwin/debug/deps/libsemver_parser-4a8c032208a2f4ee.rlib" "/home/worker/workspace/build/src/obj-firefox/testing/geckodriver/x86_64-apple-darwin/debug/deps/libslog_stdlog-67e932b2cff5fb1f.rlib" "/home/worker/workspace/build/src/obj-firefox/testing/geckodriver/x86_64-apple-darwin/debug/deps/libslog_term-8b914fe532afbc44.rlib" "/home/worker/workspace/build/src/obj-firefox/testing/geckodriver/x86_64-apple-darwin/debug/deps/libchrono-0168d8a6aeea40dc.rlib" "/home/worker/workspace/build/src/obj-firefox/testing/geckodriver/x86_64-apple-darwin/debug/deps/libslog_stream-3ee44ebe84e1ebb9.rlib" "/home/worker/workspace/build/src/obj-firefox/testing/geckodriver/x86_64-apple-darwin/debug/deps/libslog_extra-a990d429b629b1d0.rlib" "/home/worker/workspace/build/src/obj-firefox/testing/geckodriver/x86_64-apple-darwin/debug/deps/libzip-d3f9c409a03a63d6.rlib" "/home/worker/workspace/build/src/obj-firefox/testing/geckodriver/x86_64-apple-darwin/debug/deps/libflate2-90ef126ad9b1ff62.rlib" "/home/worker/workspace/build/src/obj-firefox/testing/geckodriver/x86_64-apple-darwin/debug/deps/libbzip2-e360420370eeb4e2.rlib" "/home/worker/workspace/build/src/obj-firefox/testing/geckodriver/x86_64-apple-darwin/debug/deps/libbzip2_sys-60bad8b2b9cca9a3.rlib" "/home/worker/workspace/build/src/obj-firefox/testing/geckodriver/x86_64-apple-darwin/debug/deps/libpodio-6bd3d022b13da11d.rlib" "/home/worker/workspace/build/src/obj-firefox/testing/geckodriver/x86_64-apple-darwin/debug/deps/libnum-33fcb3dcde37cf10.rlib" "/home/worker/workspace/build/src/obj-firefox/testing/geckodriver/x86_64-apple-darwin/debug/deps/libnum_iter-b399bbd189e5f67b.rlib" "/home/worker/workspace/build/src/obj-firefox/testing/geckodriver/x86_64-apple-darwin/debug/deps/libnum_integer-0ec9ef80f53fdbc9.rlib" "/home/worker/workspace/build/src/obj-firefox/testing/geckodriver/x86_64-apple-darwin/debug/deps/libnum_traits-a8c1b7cdefa880e5.rlib" "/home/worker/workspace/build/src/obj-firefox/testing/geckodriver/x86_64-apple-darwin/debug/deps/libhyper-b4edea05b00b55e6.rlib" "/home/worker/workspace/build/src/obj-firefox/testing/geckodriver/x86_64-apple-darwin/debug/deps/libmime-be428ba78bb03d1e.rlib" "/home/worker/workspace/build/src/obj-firefox/testing/geckodriver/x86_64-apple-darwin/debug/deps/liblog-aa51871bbcb36bfe.rlib" "/home/worker/workspace/build/src/obj-firefox/testing/geckodriver/x86_64-apple-darwin/debug/deps/liblanguage_tags-dce561412cfa441f.rlib" "/home/worker/workspace/build/src/obj-firefox/testing/geckodriver/x86_64-apple-darwin/debug/deps/libhttparse-41fb347870ea6b74.rlib" "/home/worker/workspace/build/src/obj-firefox/testing/geckodriver/x86_64-apple-darwin/debug/deps/libunicase-12ed77f832c85ee3.rlib" "/home/worker/workspace/build/src/obj-firefox/testing/geckodriver/x86_64-apple-darwin/debug/deps/liburl-a5dfee461d740bd1.rlib" "/home/worker/workspace/build/src/obj-firefox/testing/geckodriver/x86_64-apple-darwin/debug/deps/libbase64-671f71aca8a0bd16.rlib" "/home/worker/workspace/build/src/obj-firefox/testing/geckodriver/x86_64-apple-darwin/debug/deps/libbyteorder-190c8b8b4cb7f472.rlib" "/home/worker/workspace/build/src/obj-firefox/testing/geckodriver/x86_64-apple-darwin/debug/deps/libtypeable-f651278f97cad1e8.rlib" "/home/worker/workspace/build/src/obj-firefox/testing/geckodriver/x86_64-apple-darwin/debug/deps/liblazy_static-4aa6c4cd7f732975.rlib" "/home/worker/workspace/build/src/obj-firefox/testing/geckodriver/x86_64-apple-darwin/debug/deps/libmsdos_time-d7a0a3737b5c908c.rlib" "/home/worker/workspace/build/src/obj-firefox/testing/geckodriver/x86_64-apple-darwin/debug/deps/libcookie-453066277f34817e.rlib" "/home/worker/workspace/build/src/obj-firefox/testing/geckodriver/x86_64-apple-darwin/debug/deps/libidna-b8a2475bd5cdc5f1.rlib" "/home/worker/workspace/build/src/obj-firefox/testing/geckodriver/x86_64-apple-darwin/debug/deps/libunicode_normalization-892a5d036a7e6ea0.rlib" "/home/worker/workspace/build/src/obj-firefox/testing/geckodriver/x86_64-apple-darwin/debug/deps/libunicode_bidi-2937c5bbf2ec6434.rlib" "/home/worker/workspace/build/src/obj-firefox/testing/geckodriver/x86_64-apple-darwin/debug/deps/libtraitobject-61e8f3406c7e9438.rlib" "/home/worker/workspace/build/src/obj-firefox/testing/geckodriver/x86_64-apple-darwin/debug/deps/libslog_atomic-e16d1d4f089d6cce.rlib" "/home/worker/workspace/build/src/obj-firefox/testing/geckodriver/x86_64-apple-darwin/debug/deps/libcrossbeam-da647fd7b3fee45f.rlib" "/home/worker/workspace/build/src/obj-firefox/testing/geckodriver/x86_64-apple-darwin/debug/deps/libisatty-657d4c55c847d340.rlib" "/home/worker/workspace/build/src/obj-firefox/testing/geckodriver/x86_64-apple-darwin/debug/deps/libminiz_sys-0f6e52d3a48d4aa2.rlib" "/home/worker/workspace/build/src/obj-firefox/testing/geckodriver/x86_64-apple-darwin/debug/deps/libtime-6e7ca61692653ffb.rlib" "/home/worker/workspace/build/src/obj-firefox/testing/geckodriver/x86_64-apple-darwin/debug/deps/librustc_demangle-8c48e16ab5106ea0.rlib" "/home/worker/workspace/build/src/obj-firefox/testing/geckodriver/x86_64-apple-darwin/debug/deps/libclap-59993a804a9ef817.rlib" "/home/worker/workspace/build/src/obj-firefox/testing/geckodriver/x86_64-apple-darwin/debug/deps/libterm_size-a3a6cb671a0e0a9f.rlib" "/home/worker/workspace/build/src/obj-firefox/testing/geckodriver/x86_64-apple-darwin/debug/deps/libvec_map-556619bd7e1a994d.rlib" "/home/worker/workspace/build/src/obj-firefox/testing/geckodriver/x86_64-apple-darwin/debug/deps/libbitflags-b857f06d8702b68e.rlib" "/home/worker/workspace/build/src/obj-firefox/testing/geckodriver/x86_64-apple-darwin/debug/deps/libunicode_width-a9324100be4d7255.rlib" "/home/worker/workspace/build/src/obj-firefox/testing/geckodriver/x86_64-apple-darwin/debug/deps/libstrsim-5216133a64737ad9.rlib" "/home/worker/workspace/build/src/obj-firefox/testing/geckodriver/x86_64-apple-darwin/debug/deps/libunicode_segmentation-c5cd04b5f551e187.rlib" "/home/worker/workspace/build/src/obj-firefox/testing/geckodriver/x86_64-apple-darwin/debug/deps/libmatches-19e30f5db1f892af.rlib" "/home/worker/workspace/build/src/obj-firefox/testing/geckodriver/x86_64-apple-darwin/debug/deps/libnum_cpus-076dc5455ddc275b.rlib" "/home/worker/workspace/build/src/obj-firefox/testing/geckodriver/x86_64-apple-darwin/debug/deps/libmozprofile-89508174868eaefd.rlib" "/home/worker/workspace/build/src/obj-firefox/testing/geckodriver/x86_64-apple-darwin/debug/deps/libtempdir-4e83ed77a6d2ebe5.rlib" "/home/worker/workspace/build/src/obj-firefox/testing/geckodriver/x86_64-apple-darwin/debug/deps/librand-76456d761c2cb637.rlib" "/home/worker/workspace/build/src/obj-firefox/testing/geckodriver/x86_64-apple-darwin/debug/deps/liblazy_static-9f4fde990c1d2e9b.rlib" "/home/worker/workspace/build/src/obj-firefox/testing/geckodriver/x86_64-apple-darwin/debug/deps/libregex-0fd7d0bc93558e59.rlib" "/home/worker/workspace/build/src/obj-firefox/testing/geckodriver/x86_64-apple-darwin/debug/deps/libutf8_ranges-b81dc320c0a952bb.rlib" "/home/worker/workspace/build/src/obj-firefox/testing/geckodriver/x86_64-apple-darwin/debug/deps/libregex_syntax-51e69e15996f8c3c.rlib" "/home/worker/workspace/build/src/obj-firefox/testing/geckodriver/x86_64-apple-darwin/debug/deps/libthread_local-273e90e65080c55f.rlib" "/home/worker/workspace/build/src/obj-firefox/testing/geckodriver/x86_64-apple-darwin/debug/deps/libunreachable-9bd306f72d3bd51e.rlib" "/home/worker/workspace/build/src/obj-firefox/testing/geckodriver/x86_64-apple-darwin/debug/deps/libthread_id-0c9ad5ff40635019.rlib" "/home/worker/workspace/build/src/obj-firefox/testing/geckodriver/x86_64-apple-darwin/debug/deps/libaho_corasick-f4fdbae9a3b8b7a5.rlib" "/home/worker/workspace/build/src/obj-firefox/testing/geckodriver/x86_64-apple-darwin/debug/deps/libmemchr-69681615927cea24.rlib" "/home/worker/workspace/build/src/obj-firefox/testing/geckodriver/x86_64-apple-darwin/debug/deps/liblibc-b120399f12caad6d.rlib" "/home/worker/workspace/build/src/obj-firefox/testing/geckodriver/x86_64-apple-darwin/debug/deps/libvoid-6c52c4ddaea6e3db.rlib" "/home/worker/workspace/build/src/obj-firefox/testing/geckodriver/x86_64-apple-darwin/debug/deps/libslog-eea2cd42d168e09d.rlib" "/home/worker/workspace/build/src/rustc/lib/rustlib/x86_64-apple-darwin/lib/libstd-d19edcdb8b3582f0.rlib" "/home/worker/workspace/build/src/rustc/lib/rustlib/x86_64-apple-darwin/lib/libpanic_unwind-35809200ab841b7b.rlib" "/home/worker/workspace/build/src/rustc/lib/rustlib/x86_64-apple-darwin/lib/libunwind-dd5cb334048ac204.rlib" "/home/worker/workspace/build/src/rustc/lib/rustlib/x86_64-apple-darwin/lib/librand-eb0e42c8ae609eea.rlib" "/home/worker/workspace/build/src/rustc/lib/rustlib/x86_64-apple-darwin/lib/libcollections-6fcbe3ecfbfa6629.rlib" "/home/worker/workspace/build/src/rustc/lib/rustlib/x86_64-apple-darwin/lib/liballoc-7f2c52501770c1c7.rlib" "/home/worker/workspace/build/src/rustc/lib/rustlib/x86_64-apple-darwin/lib/liballoc_jemalloc-ea49ffd3fee5264c.rlib" "/home/worker/workspace/build/src/rustc/lib/rustlib/x86_64-apple-darwin/lib/liblibc-4ac31620c28c3400.rlib" "/home/worker/workspace/build/src/rustc/lib/rustlib/x86_64-apple-darwin/lib/libstd_unicode-7e35037032e227eb.rlib" "/home/worker/workspace/build/src/rustc/lib/rustlib/x86_64-apple-darwin/lib/libcore-10c94a1f2bd23f41.rlib" "/home/worker/workspace/build/src/rustc/lib/rustlib/x86_64-apple-darwin/lib/libcompiler_builtins-1afcf087346e8edb.rlib" "-l" "System" "-l" "pthread" "-l" "c" "-l" "m"
[task 2017-05-24T19:13:19.807391Z] 19:13:19     INFO -    = note: ld: warning: directory not found for option '-L/home/worker/workspace/src/obj-firefox'
[task 2017-05-24T19:13:19.807447Z] 19:13:19     INFO -            ld: warning: directory not found for option '-L/home/worker/workspace/src/gcc/lib64'
[task 2017-05-24T19:13:19.807514Z] 19:13:19     INFO -            Undefined symbols for architecture x86_64:
[task 2017-05-24T19:13:19.807557Z] 19:13:19     INFO -              "_mz_inflate", referenced from:
[task 2017-05-24T19:13:19.807643Z] 19:13:19     INFO -                  __ZN6flate23mem10Decompress10decompress17hd98b858cb02cfcd6E in libflate2-90ef126ad9b1ff62.rlib(flate2-90ef126ad9b1ff62.0.o)
[task 2017-05-24T19:13:19.807686Z] 19:13:19     INFO -              "_BZ2_bzDecompressEnd", referenced from:
[task 2017-05-24T19:13:19.807760Z] 19:13:19     INFO -                  __ZN67_$LT$bzip2..mem..DirDecompress$u20$as$u20$bzip2..mem..Direction$GT$7destroy17hb45c841721dfaea8E in libbzip2-e360420370eeb4e2.rlib(bzip2-e360420370eeb4e2.0.o)
[task 2017-05-24T19:13:19.807819Z] 19:13:19     INFO -              "_BZ2_bzDecompress", referenced from:
[task 2017-05-24T19:13:19.807894Z] 19:13:19     INFO -                  __ZN5bzip23mem10Decompress10decompress17h06e67a6b53be02dfE in libbzip2-e360420370eeb4e2.rlib(bzip2-e360420370eeb4e2.0.o)
[task 2017-05-24T19:13:19.807935Z] 19:13:19     INFO -              "_mz_inflateEnd", referenced from:
[task 2017-05-24T19:13:19.808038Z] 19:13:19     INFO -                  __ZN69_$LT$flate2..mem..DirDecompress$u20$as$u20$flate2..mem..Direction$GT$7destroy17hcc2d014c0fc53c08E in libflate2-90ef126ad9b1ff62.rlib(flate2-90ef126ad9b1ff62.0.o)
[task 2017-05-24T19:13:19.808078Z] 19:13:19     INFO -              "_mz_inflateInit2", referenced from:
[task 2017-05-24T19:13:19.808161Z] 19:13:19     INFO -                  __ZN6flate23mem10Decompress3new17h73b8b4f51e35acc8E in libflate2-90ef126ad9b1ff62.rlib(flate2-90ef126ad9b1ff62.0.o)
[task 2017-05-24T19:13:19.808206Z] 19:13:19     INFO -              "_BZ2_bzDecompressInit", referenced from:
[task 2017-05-24T19:13:19.808271Z] 19:13:19     INFO -                  __ZN5bzip23mem10Decompress3new17h27f04a1a8aa25939E in libbzip2-e360420370eeb4e2.rlib(bzip2-e360420370eeb4e2.0.o)
[task 2017-05-24T19:13:19.808332Z] 19:13:19     INFO -            ld: symbol(s) not found for architecture x86_64
[task 2017-05-24T19:13:19.808387Z] 19:13:19     INFO -            clang-3.9: error: linker command failed with exit code 1 (use -v to see invocation)
[task 2017-05-24T19:13:19.808424Z] 19:13:19     INFO -  error: aborting due to previous error
[task 2017-05-24T19:13:19.902363Z] 19:13:19     INFO -  error: Could not compile `geckodriver`.
[task 2017-05-24T19:13:19.902424Z] 19:13:19     INFO -  Caused by:
[task 2017-05-24T19:13:19.903603Z] 19:13:19     INFO -    process didn't exit successfully: `/home/worker/workspace/build/src/rustc/bin/rustc --crate-name geckodriver /home/worker/workspace/build/src/testing/geckodriver/src/main.rs --crate-type bin --emit=dep-info,link -C debuginfo=2 -C metadata=387c8adb9ddc9744 -C extra-filename=-387c8adb9ddc9744 --out-dir /home/worker/workspace/build/src/obj-firefox/testing/geckodriver/./x86_64-apple-darwin/debug/deps --target x86_64-apple-darwin -C linker=/home/worker/workspace/build/src/build/cargo-linker -L dependency=/home/worker/workspace/build/src/obj-firefox/testing/geckodriver/./x86_64-apple-darwin/debug/deps -L dependency=/home/worker/workspace/build/src/obj-firefox/testing/geckodriver/./debug/deps --extern hyper=/home/worker/workspace/build/src/obj-firefox/testing/geckodriver/./x86_64-apple-darwin/debug/deps/libhyper-b4edea05b00b55e6.rlib --extern regex=/home/worker/workspace/build/src/obj-firefox/testing/geckodriver/./x86_64-apple-darwin/debug/deps/libregex-0fd7d0bc93558e59.rlib --extern chrono=/home/worker/workspace/build/src/obj-firefox/testing/geckodriver/./x86_64-apple-darwin/debug/deps/libchrono-0168d8a6aeea40dc.rlib --extern mozprofile=/home/worker/workspace/build/src/obj-firefox/testing/geckodriver/./x86_64-apple-darwin/debug/deps/libmozprofile-89508174868eaefd.rlib --extern slog_stdlog=/home/worker/workspace/build/src/obj-firefox/testing/geckodriver/./x86_64-apple-darwin/debug/deps/libslog_stdlog-67e932b2cff5fb1f.rlib --extern slog_stream=/home/worker/workspace/build/src/obj-firefox/testing/geckodriver/./x86_64-apple-darwin/debug/deps/libslog_stream-3ee44ebe84e1ebb9.rlib --extern clap=/home/worker/workspace/build/src/obj-firefox/testing/geckodriver/./x86_64-apple-darwin/debug/deps/libclap-59993a804a9ef817.rlib --extern rustc_serialize=/home/worker/workspace/build/src/obj-firefox/testing/geckodriver/./x86_64-apple-darwin/debug/deps/librustc_serialize-2f01b5d382e94952.rlib --extern zip=/home/worker/workspace/build/src/obj-firefox/testing/geckodriver/./x86_64-apple-darwin/debug/deps/libzip-d3f9c409a03a63d6.rlib --extern webdriver=/home/worker/workspace/build/src/obj-firefox/testing/geckodriver/./x86_64-apple-darwin/debug/deps/libwebdriver-997383d7dc776fdb.rlib --extern lazy_static=/home/worker/workspace/build/src/obj-firefox/testing/geckodriver/./x86_64-apple-darwin/debug/deps/liblazy_static-9f4fde990c1d2e9b.rlib --extern mozrunner=/home/worker/workspace/build/src/obj-firefox/testing/geckodriver/./x86_64-apple-darwin/debug/deps/libmozrunner-73ec0efab473f00a.rlib --extern mozversion=/home/worker/workspace/build/src/obj-firefox/testing/geckodriver/./x86_64-apple-darwin/debug/deps/libmozversion-d92b828eab08e68a.rlib --extern uuid=/home/worker/workspace/build/src/obj-firefox/testing/geckodriver/./x86_64-apple-darwin/debug/deps/libuuid-9d54d20637a1e138.rlib --extern log=/home/worker/workspace/build/src/obj-firefox/testing/geckodriver/./x86_64-apple-darwin/debug/deps/liblog-aa51871bbcb36bfe.rlib --extern slog=/home/worker/workspace/build/src/obj-firefox/testing/geckodriver/./x86_64-apple-darwin/debug/deps/libslog-eea2cd42d168e09d.rlib --extern slog_atomic=/home/worker/workspace/build/src/obj-firefox/testing/geckodriver/./x86_64-apple-darwin/debug/deps/libslog_atomic-e16d1d4f089d6cce.rlib -L native=/home/worker/workspace/build/src/obj-firefox/testing/geckodriver/./x86_64-apple-darwin/debug/build/bzip2-sys-757da42682099d9d/out -L native=/home/worker/workspace/build/src/obj-firefox/testing/geckodriver/./x86_64-apple-darwin/debug/build/miniz-sys-07cc64aa136ffbd3/out` (exit code: 101)
[task 2017-05-24T19:13:19.903667Z] 19:13:19     INFO -  gmake[5]: *** [force-cargo-program-build] Error 101
[task 2017-05-24T19:13:19.903719Z] 19:13:19     INFO -  gmake[5]: Leaving directory `/home/worker/workspace/build/src/obj-firefox/testing/geckodriver'
[task 2017-05-24T19:13:19.903760Z] 19:13:19     INFO -  gmake[4]: *** [testing/geckodriver/target] Error 2

Probably missing a system development header dependency?
With cross compilation, is this still something that we want to do?
Flags: needinfo?(ato)
Priority: -- → P3
(Reporter)

Comment 2

4 days ago
(In reply to David Burns :automatedtester from comment #1)
> With cross compilation, is this still something that we want to do?

It is _due_ to cross compilation that this happens.
Flags: needinfo?(ato)
You need to log in before you can comment on or make changes to this bug.