Closed Bug 1419521 Opened 8 years ago Closed 7 years ago

Intermittent mozmake.EXE[2]: *** [check] Error 127

Categories

(Release Engineering :: General, defect, P5)

defect

Tracking

(Not tracked)

RESOLVED INCOMPLETE

People

(Reporter: intermittent-bug-filer, Unassigned)

Details

(Keywords: intermittent-failure)

Filed by: archaeopteryx [at] coole-files.de https://treeherder.mozilla.org/logviewer.html#?job_id=146469090&repo=autoland https://queue.taskcluster.net/v1/task/Jqt7J_iLStel074aGQ4CCg/runs/0/artifacts/public/logs/live_backing.log 18:02:07 INFO - Finished 'mach python-test' successfully 18:02:07 INFO - z:/build/build/src/mozmake.EXE recurse_check 18:02:07 INFO - mozmake.EXE[1]: Entering directory 'z:/build/build/src/obj-firefox' 18:02:08 INFO - mozmake.EXE[2]: Entering directory 'z:/build/build/src/obj-firefox/config' 18:02:08 INFO - z:/build/build/src/mozmake.EXE -C tests/src-simple check-jar 18:02:08 INFO - mozmake.EXE[2]: Entering directory 'z:/build/build/src/obj-firefox/build/win32' 18:02:08 INFO - z:/build/build/src/obj-firefox/_virtualenv/Scripts/python.exe z:/build/build/src/build/win32/autobinscope.py ../../dist/bin/firefox.exe ../../dist/crashreporter-symbols/ 18:02:08 INFO - mozmake.EXE[2]: Entering directory 'z:/build/build/src/obj-firefox/memory/replace/logalloc/replay' 18:02:08 INFO - grep "^1 " z:/build/build/src/memory/replace/logalloc/replay/replay.log > expected_output.log 18:02:08 INFO - mozmake.EXE[2]: Entering directory 'z:/build/build/src/obj-firefox/toolkit/xre/test/win' 18:02:08 INFO - mozmake.EXE[3]: Entering directory 'z:/build/build/src/obj-firefox/config/tests/src-simple' 18:02:08 INFO - if test -d ../../../dist/xpi-stage/test_jar_mn; then rm -rf ../../../dist/xpi-stage/test_jar_mn; fi; 18:02:08 INFO - bash.exe: warning: could not find /tmp, please create! 18:02:08 INFO - /bin/sh: C:/Users/task_1511281622/AppData/Local/Temp/make608-1.sh: No such file or directory 18:02:08 INFO - Makefile:21: recipe for target 'check' failed 18:02:08 INFO - mozmake.EXE[2]: *** [check] Error 127 18:02:08 INFO - mozmake.EXE[2]: Leaving directory 'z:/build/build/src/obj-firefox/toolkit/xre/test/win' 18:02:08 INFO - z:/build/build/src/config/recurse.mk:100: recipe for target 'toolkit/xre/test/win/check' failed 18:02:08 INFO - mozmake.EXE[1]: *** [toolkit/xre/test/win/check] Error 2
Given Buildduty manifesto[1], this seems like an error that doesn't fall on Buildduty's plate. Moving this over to General Automation for now, until we find a more suited owner. Please move back if I'm wrong. [1]: https://wiki.mozilla.org/ReleaseEngineering/Buildduty_manifesto#Things_Buildduty_isn.E2.80.99t_responsible_for
Component: Buildduty → General Automation
Status: NEW → RESOLVED
Closed: 8 years ago
Resolution: --- → INCOMPLETE
Component: General Automation → General
Status: REOPENED → RESOLVED
Closed: 8 years ago7 years ago
Resolution: --- → INCOMPLETE
You need to log in before you can comment on or make changes to this bug.