Closed
Bug 1480990
Opened 8 years ago
Closed 8 years ago
Intermittent make[4]: *** [host_nsinstall.o] Error 2 after sccache: Failed to send data to or receive data from server
Categories
(Firefox Build System :: General, defect, P5)
Firefox Build System
General
Tracking
(Not tracked)
RESOLVED
INCOMPLETE
People
(Reporter: intermittent-bug-filer, Unassigned)
Details
(Keywords: intermittent-failure)
Filed by: apavel [at] mozilla.com
https://treeherder.mozilla.org/logviewer.html#?job_id=192054752&repo=autoland
https://queue.taskcluster.net/v1/task/cUDAlnPxTPGczTHKOomHVg/runs/0/artifacts/public/logs/live_backing.log
[task 2018-08-04T13:53:47.223Z] 13:53:47 INFO - error: failed to execute compile
[task 2018-08-04T13:53:47.223Z] 13:53:47 INFO - caused by: Failed to send data to or receive data from server
[task 2018-08-04T13:53:47.223Z] 13:53:47 INFO - caused by: Failed to read response header
[task 2018-08-04T13:53:47.223Z] 13:53:47 INFO - caused by: failed to fill whole buffer
[task 2018-08-04T13:53:47.224Z] 13:53:47 INFO - /builds/worker/workspace/build/src/config/rules.mk:751: recipe for target 'host_nsinstall.o' failed
[task 2018-08-04T13:53:47.224Z] 13:53:47 INFO - make[4]: *** [host_nsinstall.o] Error 2
[task 2018-08-04T13:53:47.224Z] 13:53:47 INFO - make[4]: Leaving directory '/builds/worker/workspace/build/src/obj-firefox/config'
[task 2018-08-04T13:53:47.224Z] 13:53:47 INFO - make[4]: *** Waiting for unfinished jobs....
[task 2018-08-04T13:53:47.224Z] 13:53:47 INFO - make[4]: Entering directory '/builds/worker/workspace/build/src/obj-firefox/config'
[task 2018-08-04T13:53:47.224Z] 13:53:47 INFO - /builds/worker/workspace/build/src/sccache2/sccache /builds/worker/workspace/build/src/gcc/bin/gcc -std=gnu99 -o host_pathsub.o -c -DXP_UNIX -freorder-blocks -Os -DDEBUG=1 -D_UNICODE -DUNICODE -I/builds/worker/workspace/build/src/config -I/builds/worker/workspace/build/src/obj-firefox/config -I/builds/worker/workspace/build/src/obj-firefox/dist/include -MD -MP -MF .deps/host_pathsub.o.pp -I/builds/worker/workspace/build/src/obj-firefox/dist/include/nspr /builds/worker/workspace/build/src/config/pathsub.c
[task 2018-08-04T13:53:47.224Z] 13:53:47 INFO - error: failed to execute compile
[task 2018-08-04T13:53:47.224Z] 13:53:47 INFO - caused by: Failed to send data to or receive data from server
[task 2018-08-04T13:53:47.224Z] 13:53:47 INFO - caused by: Failed to read response header
[task 2018-08-04T13:53:47.224Z] 13:53:47 INFO - caused by: failed to fill whole buffer
[task 2018-08-04T13:53:47.224Z] 13:53:47 INFO - /builds/worker/workspace/build/src/config/rules.mk:751: recipe for target 'host_pathsub.o' failed
[task 2018-08-04T13:53:47.224Z] 13:53:47 INFO - make[4]: *** [host_pathsub.o] Error 2
[task 2018-08-04T13:53:47.224Z] 13:53:47 INFO - make[4]: Leaving directory '/builds/worker/workspace/build/src/obj-firefox/config'
[task 2018-08-04T13:53:47.224Z] 13:53:47 INFO - /builds/worker/workspace/build/src/config/recurse.mk:74: recipe for target 'config/host' failed
[task 2018-08-04T13:53:47.224Z] 13:53:47 INFO - make[3]: *** [config/host] Error 2
[task 2018-08-04T13:53:47.225Z] 13:53:47 INFO - /builds/worker/workspace/build/src/config/recurse.mk:32: recipe for target 'export' failed
[task 2018-08-04T13:53:47.225Z] 13:53:47 INFO - make[2]: *** [export] Error 2
[task 2018-08-04T13:53:47.225Z] 13:53:47 INFO - /builds/worker/workspace/build/src/config/rules.mk:423: recipe for target 'default' failed
[task 2018-08-04T13:53:47.225Z] 13:53:47 INFO - make[1]: *** [default] Error 2
[task 2018-08-04T13:53:47.225Z] 13:53:47 INFO - client.mk:150: recipe for target 'build' failed
[task 2018-08-04T13:53:47.225Z] 13:53:47 INFO - make: *** [build] Error 2
[task 2018-08-04T13:53:47.232Z] 13:53:47 INFO - 0 compiler warnings present.
[task 2018-08-04T13:53:47.281Z] 13:53:47 ERROR - Return code: 2
[task 2018-08-04T13:53:47.282Z] 13:53:47 WARNING - setting return code to 2
[task 2018-08-04T13:53:47.282Z] 13:53:47 FATAL - 'mach build -v' did not run successfully. Please check log for errors.
[task 2018-08-04T13:53:47.282Z] 13:53:47 FATAL - Running post_fatal callback...
[task 2018-08-04T13:53:47.282Z] 13:53:47 FATAL - Exiting -1
[task 2018-08-04T13:53:47.282Z] 13:53:47 INFO - [mozharness: 2018-08-04 13:53:47.282376Z] Finished build step (failed)
[task 2018-08-04T13:53:47.282Z] 13:53:47 INFO - Running post-run listener: _summarize
[task 2018-08-04T13:53:47.282Z] 13:53:47 ERROR - # TBPL FAILURE #
[task 2018-08-04T13:53:47.282Z] 13:53:47 INFO - [mozharness: 2018-08-04 13:53:47.282599Z] FxDesktopBuild summary:
[task 2018-08-04T13:53:47.282Z] 13:53:47 ERROR - # TBPL FAILURE #
Updated•8 years ago
|
Summary: Intermittent make[4]: *** [host_nsinstall.o] Error 2 → Intermittent make[4]: *** [host_nsinstall.o] Error 2 after sccache: Failed to send data to or receive data from server
Comment 1•8 years ago
|
||
Status: NEW → RESOLVED
Closed: 8 years ago
Resolution: --- → INCOMPLETE
You need to log in
before you can comment on or make changes to this bug.
Description
•