Closed Bug 1484089 Opened 3 years ago Closed 2 years ago

Intermittent make: *** [configure] Error 1

Categories

(Firefox Build System :: General, defect, P5)

defect

Tracking

(Not tracked)

RESOLVED INCOMPLETE

People

(Reporter: intermittent-bug-filer, Unassigned)

References

Details

(Keywords: intermittent-failure)

Filed by: apavel [at] mozilla.com

https://treeherder.mozilla.org/logviewer.html#?job_id=194397634&repo=mozilla-inbound

https://queue.taskcluster.net/v1/task/AD3WEn7mTZaHO5cfZdyJFA/runs/0/artifacts/public/logs/live_backing.log

[task 2018-08-16T19:46:34.709Z] 19:46:34     INFO -  DEBUG: Executing: `/builds/worker/workspace/build/src/sccache2/sccache /builds/worker/workspace/build/src/clang/bin/clang -E /tmp/conftest.S4vPeg.c`
[task 2018-08-16T19:46:34.709Z] 19:46:34     INFO -  DEBUG: The command returned non-zero exit status 2.
[task 2018-08-16T19:46:34.709Z] 19:46:34     INFO -  DEBUG: Its error output was:
[task 2018-08-16T19:46:34.709Z] 19:46:34     INFO -  DEBUG: | error: Connection to server timed out
[task 2018-08-16T19:46:34.709Z] 19:46:34     INFO -  ERROR: Command `/builds/worker/workspace/build/src/sccache2/sccache /builds/worker/workspace/build/src/clang/bin/clang -E /tmp/conftest.S4vPeg.c` failed with exit status 2.
[task 2018-08-16T19:46:34.730Z] 19:46:34     INFO -  *** Fix above errors and then restart with\
[task 2018-08-16T19:46:34.730Z] 19:46:34     INFO -                 "/usr/bin/make -f client.mk build"
[task 2018-08-16T19:46:34.730Z] 19:46:34     INFO -  client.mk:123: recipe for target 'configure' failed
[task 2018-08-16T19:46:34.730Z] 19:46:34     INFO -  make: *** [configure] Error 1
[task 2018-08-16T19:46:34.781Z] 19:46:34    ERROR - Return code: 2
[task 2018-08-16T19:46:34.782Z] 19:46:34  WARNING - setting return code to 2
[task 2018-08-16T19:46:34.782Z] 19:46:34    FATAL - 'mach build -v' did not run successfully. Please check log for errors.
[task 2018-08-16T19:46:34.782Z] 19:46:34    FATAL - Running post_fatal callback...
[task 2018-08-16T19:46:34.782Z] 19:46:34    FATAL - Exiting -1
[task 2018-08-16T19:46:34.782Z] 19:46:34     INFO - [mozharness: 2018-08-16 19:46:34.782654Z] Finished build step (failed)
[task 2018-08-16T19:46:34.782Z] 19:46:34     INFO - Running post-run listener: _summarize
[task 2018-08-16T19:46:34.782Z] 19:46:34    ERROR - # TBPL FAILURE #
[task 2018-08-16T19:46:34.783Z] 19:46:34     INFO - [mozharness: 2018-08-16 19:46:34.783048Z] FxDesktopBuild summary:
[task 2018-08-16T19:46:34.783Z] 19:46:34    ERROR - # TBPL FAILURE #
[task 2018-08-16T19:46:34.783Z] 19:46:34     INFO - Running post-run listener: copy_logs_to_upload_dir
See Also: → 1484437
https://wiki.mozilla.org/Bug_Triage#Intermittent_Test_Failure_Cleanup
Status: NEW → RESOLVED
Closed: 3 years ago
Resolution: --- → INCOMPLETE
Status: RESOLVED → REOPENED
Resolution: INCOMPLETE → ---

That's a different error than the one this bug was filed for. That's more like bug 1528380, but for OSX, you should open a new bug.

Status: REOPENED → RESOLVED
Closed: 3 years ago3 years ago
Resolution: --- → INCOMPLETE

Thanks Mike, I filed bug 1530263.

Status: REOPENED → RESOLVED
Closed: 3 years ago2 years ago
Resolution: --- → INCOMPLETE

Recent failure https://treeherder.mozilla.org/#/jobs?repo=autoland&selectedJob=264331524&resultStatus=testfailed%2Cbusted%2Cexception&revision=ac42ae777d5cdab6ddbe4b01411be39910c2a069&searchStr=android%2C5.0%2Cx86-64%2Cdebug%2Cbuild-android-x86_64%2Fdebug%2C%28b%29

Log failure https://treeherder.mozilla.org/logviewer.html#?job_id=264331524&repo=autoland

Part of that log
task 2019-08-30T21:37:58.915Z] 21:37:58 INFO - checking whether the target C compiler can be used...
[task 2019-08-30T21:37:58.915Z] 21:37:58 INFO - DEBUG: <truncated - see config.log for full output>
[task 2019-08-30T21:37:58.915Z] 21:37:58 INFO - DEBUG: | %KERNEL "Linux"
[task 2019-08-30T21:37:58.915Z] 21:37:58 INFO - DEBUG: | #elif _WIN32 || CYGWIN
[task 2019-08-30T21:37:58.915Z] 21:37:58 INFO - DEBUG: | %KERNEL "WINNT"
[task 2019-08-30T21:37:58.915Z] 21:37:58 INFO - DEBUG: | #elif NetBSD
[task 2019-08-30T21:37:58.916Z] 21:37:58 INFO - DEBUG: | %KERNEL "NetBSD"
[task 2019-08-30T21:37:58.916Z] 21:37:58 INFO - DEBUG: | #elif APPLE
[task 2019-08-30T21:37:58.916Z] 21:37:58 INFO - DEBUG: | %KERNEL "Darwin"
[task 2019-08-30T21:37:58.916Z] 21:37:58 INFO - DEBUG: | #endif
[task 2019-08-30T21:37:58.916Z] 21:37:58 INFO - DEBUG: | #if ANDROID
[task 2019-08-30T21:37:58.916Z] 21:37:58 INFO - DEBUG: | %OS "Android"
[task 2019-08-30T21:37:58.916Z] 21:37:58 INFO - DEBUG: | #endif
[task 2019-08-30T21:37:58.916Z] 21:37:58 INFO - DEBUG: | #if BYTE_ORDER == ORDER_LITTLE_ENDIAN
[task 2019-08-30T21:37:58.916Z] 21:37:58 INFO - DEBUG: | %ENDIANNESS "little"
[task 2019-08-30T21:37:58.916Z] 21:37:58 INFO - DEBUG: | #elif BYTE_ORDER == ORDER_BIG_ENDIAN
[task 2019-08-30T21:37:58.916Z] 21:37:58 INFO - DEBUG: | %ENDIANNESS "big"
[task 2019-08-30T21:37:58.916Z] 21:37:58 INFO - DEBUG: | #endif
[task 2019-08-30T21:37:58.917Z] 21:37:58 INFO - DEBUG: Executing: /builds/worker/fetches/sccache/sccache /builds/worker/fetches/clang/bin/clang -E /tmp/conftest.DR2Ro8.c
[task 2019-08-30T21:37:58.917Z] 21:37:58 INFO - DEBUG: The command returned non-zero exit status 2.
[task 2019-08-30T21:37:58.917Z] 21:37:58 INFO - DEBUG: Its error output was:
[task 2019-08-30T21:37:58.917Z] 21:37:58 INFO - DEBUG: | error: Connection to server timed out
[task 2019-08-30T21:37:58.917Z] 21:37:58 INFO - ERROR: Command /builds/worker/fetches/sccache/sccache /builds/worker/fetches/clang/bin/clang -E /tmp/conftest.DR2Ro8.c failed with exit status 2.
[task 2019-08-30T21:37:58.952Z] 21:37:58 INFO - *** Fix above errors and then restart with
[task 2019-08-30T21:37:58.952Z] 21:37:58 INFO - "./mach build"
[task 2019-08-30T21:37:58.952Z] 21:37:58 INFO - client.mk:111: recipe for target 'configure' failed
[task 2019-08-30T21:37:58.952Z] 21:37:58 INFO - make: *** [configure] Error 1
[task 2019-08-30T21:37:59.010Z] 21:37:59 ERROR - Return code: 2
[task 2019-08-30T21:37:59.010Z] 21:37:59 WARNING - setting return code to 2
[task 2019-08-30T21:37:59.010Z] 21:37:59 FATAL - 'mach build -v' did not run successfully. Please check log for errors.
[task 2019-08-30T21:37:59.010Z] 21:37:59 FATAL - Running post_fatal callback...
[task 2019-08-30T21:37:59.010Z] 21:37:59 FATAL - Exiting -1
[task 2019-08-30T21:37:59.010Z] 21:37:59 INFO - [mozharness: 2019-08-30 21:37:59.010413Z] Finished build step (failed)
[task 2019-08-30T21:37:59.010Z] 21:37:59 INFO - Running post-run listener: _parse_build_tests_ccov
[task 2019-08-30T21:37:59.010Z] 21:37:59 INFO - Running command: ['/builds/worker/workspace/build/src/obj-x86_64-pc-linux-gnu/_virtualenvs/init/bin/python', 'mach', 'python', 'testing/parse_build_tests_ccov.py'] in /builds/worker/workspace/build/src
[task 2019-08-30T21:37:59.010Z] 21:37:59 INFO - Copy/paste: /builds/worker/workspace/build/src/obj-x86_64-pc-linux-gnu/_virtualenvs/init/bin/python mach python testing/parse_build_tests_ccov.py
[task 2019-08-30T21:37:59.013Z] 21:37:59 INFO - Using env: {'ACCEPTED_MAR_CHANNEL_IDS': 'firefox-mozilla-central',
[task 2019-08-30T21:37:59.013Z] 21:37:59 INFO - 'DEBIAN_FRONTEND': 'noninteractive',
[task 2019-08-30T21:37:59.013Z] 21:37:59 INFO - 'DISPLAY': ':2',
[task 2019-08-30T21:37:59.013Z] 21:37:59 INFO - 'GECKO_BASE_REPOSITORY': 'https://hg.mozilla.org/mozilla-unified',
[task 2019-08-30T21:37:59.013Z] 21:37:59 INFO - 'GECKO_HEAD_REPOSITORY': 'https://hg.mozilla.org/integration/autoland',
[task 2019-08-30T21:37:59.013Z] 21:37:59 INFO - 'GECKO_HEAD_REV': 'ac42ae777d5cdab6ddbe4b01411be39910c2a069',
[task 2019-08-30T21:37:59.013Z] 21:37:59 INFO - 'GECKO_PATH': '/builds/worker/workspace/build/src',
[task 2019-08-30T21:37:59.013Z] 21:37:59 INFO - 'GRADLE_USER_HOME': '/builds/worker/workspace/build/src/mobile/android/gradle/dotgradle-offline',
[task 2019-08-30T21:37:59.013Z] 21:37:59 INFO - 'GRCOV_PATH': '/builds/worker/fetches/grcov',
[task 2019-08-30T21:37:59.013Z] 21:37:59 INFO - 'HG_SHARE_BASE_DIR': '/builds/hg-shared',
[task 2019-08-30T21:37:59.013Z] 21:37:59 INFO - 'HG_STORE_PATH': '/builds/worker/checkouts/hg-store',
[task 2019-08-30T21:37:59.013Z] 21:37:59 INFO - 'HOME': '/builds/worker',
[task 2019-08-30T21:37:59.013Z] 21:37:59 INFO - 'HOSTNAME': 'taskcluster-worker',
[task 2019-08-30T21:37:59.013Z] 21:37:59 INFO - 'LC_ALL': 'C',
[task 2019-08-30T21:37:59.013Z] 21:37:59 INFO - 'LIBRARY_PATH': ':/builds/worker/workspace/src/obj-firefox:/builds/worker/workspace/src/gcc/lib64',
[task 2019-08-30T21:37:59.013Z] 21:37:59 INFO - 'LOGNAME': 'worker',
[task 2019-08-30T21:37:59.013Z] 21:37:59 INFO - 'MACH_MAIN_PID': '50',
[task 2019-08-30T21:37:59.013Z] 21:37:59 INFO - 'MAR_CHANNEL_ID': 'firefox-mozilla-central',
[task 2019-08-30T21:37:59.013Z] 21:37:59 INFO - 'MH_BRANCH': 'autoland',
[task 2019-08-30T21:37:59.013Z] 21:37:59 INFO - 'MH_BUILD_POOL': 'taskcluster',
[task 2019-08-30T21:37:59.013Z] 21:37:59 INFO - 'MH_CUSTOM_BUILD_VARIANT_CFG': 'x86_64-debug',
[task 2019-08-30T21:37:59.013Z] 21:37:59 INFO - 'MOZBUILD_STATE_PATH': '/builds/worker/.mozbuild',
[task 2019-08-30T21:37:59.013Z] 21:37:59 INFO - 'MOZHARNESS_ACTIONS': 'get-secrets build',
[task 2019-08-30T21:37:59.013Z] 21:37:59 INFO - 'MOZHARNESS_CONFIG': 'builds/releng_base_android_64_builds.py',
[task 2019-08-30T21:37:59.013Z] 21:37:59 INFO - 'MOZHARNESS_SCRIPT': 'mozharness/scripts/fx_desktop_build.py',
[task 2019-08-30T21:37:59.013Z] 21:37:59 INFO - 'MOZ_AUTOMATION': '1',
[task 2019-08-30T21:37:59.013Z] 21:37:59 INFO - 'MOZ_BUILD_DATE': '20190830211020',
[task 2019-08-30T21:37:59.013Z] 21:37:59 INFO - 'MOZ_CRASHREPORTER_NO_REPORT': '1',
[task 2019-08-30T21:37:59.013Z] 21:37:59 INFO - 'MOZ_DISABLE_FULL_SYMBOLS': '1',

Status: RESOLVED → REOPENED
Resolution: INCOMPLETE → ---
Status: REOPENED → RESOLVED
Closed: 2 years ago2 years ago
Resolution: --- → INCOMPLETE
You need to log in before you can comment on or make changes to this bug.