Closed Bug 1486330 Opened 8 years ago Closed 7 years ago

Intermittent l10n-check> mozmake.EXE[3]: *** [l10n-check] Error -1073741819

Categories

(Firefox Build System :: General, defect, P5)

defect

Tracking

(Not tracked)

RESOLVED INCOMPLETE

People

(Reporter: intermittent-bug-filer, Unassigned)

Details

(Keywords: intermittent-failure)

Filed by: apavel [at] mozilla.com https://treeherder.mozilla.org/logviewer.html#?job_id=196009291&repo=mozilla-inbound https://queue.taskcluster.net/v1/task/Y3YH-9iCRKiTIMRoB2600Q/runs/0/artifacts/public/logs/live_backing.log 22:43:12 INFO - l10n-check> Makefile:126: recipe for target 'l10n-check' failed 22:43:12 INFO - l10n-check> mozmake.EXE[3]: *** [l10n-check] Error -1073741819 22:43:12 INFO - l10n-check> mozmake.EXE[3]: Leaving directory 'z:/build/build/src/obj-firefox/browser/locales' 22:43:12 INFO - l10n-check> z:/build/build/src/browser/build.mk:36: recipe for target 'l10n-check' failed 22:43:12 INFO - l10n-check> mozmake.EXE[2]: *** [l10n-check] Error 2 22:43:12 INFO - z:/build/build/src/build/moz-automation.mk:89: recipe for target 'automation/l10n-check' failed 22:43:12 INFO - mozmake.EXE[1]: *** [automation/l10n-check] Error 2 22:43:12 INFO - client.mk:154: recipe for target 'build' failed 22:43:12 INFO - mozmake.EXE: *** [build] Error 2 22:43:12 INFO - 635 compiler warnings present. 22:43:12 ERROR - Return code: 2 22:43:12 WARNING - setting return code to 2 22:43:12 FATAL - 'mach build -v' did not run successfully. Please check log for errors. 22:43:12 FATAL - Running post_fatal callback... 22:43:12 FATAL - Exiting -1 22:43:12 INFO - [mozharness: 2018-08-26 22:43:12.711000Z] Finished build step (failed) 22:43:12 INFO - Running post-run listener: _summarize 22:43:12 ERROR - # TBPL FAILURE # 22:43:12 INFO - [mozharness: 2018-08-26 22:43:12.711000Z] FxDesktopBuild summary: 22:43:12 ERROR - # TBPL FAILURE # 22:43:12 INFO - Running post-run listener: copy_logs_to_upload_dir 22:43:12 INFO - Copying logs to upload dir... 22:43:12 INFO - mkdir: z:\build\build\upload\logs [taskcluster 2018-08-26T22:43:12.755Z] Exit Code: 4294967295 [taskcluster 2018-08-26T22:43:12.755Z] User Time: 0s [taskcluster 2018-08-26T22:43:12.755Z] Kernel Time: 15.625ms [taskcluster 2018-08-26T22:43:12.755Z] Wall Time: 33m14.4904168s [taskcluster 2018-08-26T22:43:12.755Z] Result: FAILED
Status: NEW → RESOLVED
Closed: 7 years ago
Resolution: --- → INCOMPLETE
You need to log in before you can comment on or make changes to this bug.