Closed Bug 1497743 Opened 6 years ago Closed 5 years ago

Intermittent js/xpconnect/tests/marionette/test_loader_global_sharing.py TestLoaderGlobalSharing.test_global_sharing_settings | IOError: Process killed because the connection to Marionette server is lost. Check gecko.log for errors (Reason: No data receiv

Categories

(Core :: XPConnect, defect, P5)

All
Linux
defect

Tracking

()

RESOLVED INCOMPLETE

People

(Reporter: intermittent-bug-filer, Unassigned)

References

Details

(Keywords: intermittent-failure)

Filed by: btara [at] mozilla.com https://treeherder.mozilla.org/logviewer.html#?job_id=204338963&repo=mozilla-central https://queue.taskcluster.net/v1/task/ALFEkg3ORYm5O1csiqooJQ/runs/0/artifacts/public/logs/live_backing.log [task 2018-10-09T21:59:36.220Z] 21:59:36 INFO - 1539122376209 Marionette DEBUG Received observer notification xpcom-will-shutdown [task 2018-10-09T21:59:36.225Z] 21:59:36 INFO - 1539122376209 Marionette DEBUG Remote service is inactive [task 2018-10-09T21:59:36.742Z] 21:59:36 INFO - 1539122376738 Marionette DEBUG Received observer notification profile-after-change [task 2018-10-09T21:59:36.783Z] 21:59:36 INFO - 1539122376777 Marionette DEBUG Received observer notification command-line-startup [task 2018-10-09T22:03:36.978Z] 22:03:36 INFO - TEST-UNEXPECTED-ERROR | js/xpconnect/tests/marionette/test_loader_global_sharing.py TestLoaderGlobalSharing.test_global_sharing_settings | IOError: Process killed because the connection to Marionette server is lost. Check gecko.log for errors (Reason: No data received over socket) [task 2018-10-09T22:03:36.981Z] 22:03:36 INFO - Traceback (most recent call last): [task 2018-10-09T22:03:36.982Z] 22:03:36 INFO - File "/builds/worker/workspace/build/venv/lib/python2.7/site-packages/marionette_harness/marionette_test/testcases.py", line 159, in run [task 2018-10-09T22:03:36.983Z] 22:03:36 INFO - testMethod() [task 2018-10-09T22:03:36.984Z] 22:03:36 INFO - File "/builds/worker/workspace/build/tests/marionette/tests/js/xpconnect/tests/marionette/test_loader_global_sharing.py", line 106, in test_global_sharing_settings [task 2018-10-09T22:03:36.985Z] 22:03:36 INFO - env={GLOBAL_SHARING_VAR: var}) [task 2018-10-09T22:03:36.986Z] 22:03:36 INFO - File "/builds/worker/workspace/build/tests/marionette/tests/js/xpconnect/tests/marionette/test_loader_global_sharing.py", line 43, in restart [task 2018-10-09T22:03:36.988Z] 22:03:36 INFO - self.marionette.restart(in_app=True, clean=False) [task 2018-10-09T22:03:36.989Z] 22:03:36 INFO - File "/builds/worker/workspace/build/venv/lib/python2.7/site-packages/marionette_driver/decorators.py", line 36, in _ [task 2018-10-09T22:03:36.990Z] 22:03:36 INFO - m._handle_socket_failure() [task 2018-10-09T22:03:36.992Z] 22:03:36 INFO - File "/builds/worker/workspace/build/venv/lib/python2.7/site-packages/marionette_driver/marionette.py", line 841, in _handle_socket_failure [task 2018-10-09T22:03:36.995Z] 22:03:36 INFO - reraise(IOError, message.format(returncode=returncode, reason=val), tb) [task 2018-10-09T22:03:36.996Z] 22:03:36 INFO - File "/builds/worker/workspace/build/venv/lib/python2.7/site-packages/marionette_driver/decorators.py", line 26, in _ [task 2018-10-09T22:03:36.998Z] 22:03:36 INFO - return func(*args, **kwargs) [task 2018-10-09T22:03:36.999Z] 22:03:36 INFO - File "/builds/worker/workspace/build/venv/lib/python2.7/site-packages/marionette_driver/marionette.py", line 1196, in restart [task 2018-10-09T22:03:37.000Z] 22:03:37 INFO - self._send_message("acceptConnections", {"value": True}) [task 2018-10-09T22:03:37.014Z] 22:03:37 INFO - File "/builds/worker/workspace/build/venv/lib/python2.7/site-packages/marionette_driver/decorators.py", line 26, in _ [task 2018-10-09T22:03:37.016Z] 22:03:37 INFO - return func(*args, **kwargs) [task 2018-10-09T22:03:37.017Z] 22:03:37 INFO - File "/builds/worker/workspace/build/venv/lib/python2.7/site-packages/marionette_driver/marionette.py", line 753, in _send_message [task 2018-10-09T22:03:37.018Z] 22:03:37 INFO - msg = self.client.request(name, params) [task 2018-10-09T22:03:37.019Z] 22:03:37 INFO - File "/builds/worker/workspace/build/venv/lib/python2.7/site-packages/marionette_driver/transport.py", line 273, in request [task 2018-10-09T22:03:37.021Z] 22:03:37 INFO - return self.receive() [task 2018-10-09T22:03:37.022Z] 22:03:37 INFO - File "/builds/worker/workspace/build/venv/lib/python2.7/site-packages/marionette_driver/transport.py", line 159, in receive [task 2018-10-09T22:03:37.023Z] 22:03:37 INFO - raise socket.error("No data received over socket") [task 2018-10-09T22:03:37.025Z] 22:03:37 INFO - TEST-INFO took 253701ms [task 2018-10-09T22:03:37.027Z] 22:03:37 ERROR - test_end for js/xpconnect/tests/marionette/test_loader_global_sharing.py TestLoaderGlobalSharing.test_global_sharing_settings logged while not in progress. Logged with data: {"status": "ERROR", "extra": {"class_name": "test_loader_global_sharing.TestLoaderGlobalSharing", "method_name": "test_global_sharing_settings"}, "expected": "PASS", "test": "js/xpconnect/tests/marionette/test_loader_global_sharing.py TestLoaderGlobalSharing.test_global_sharing_settings", "message": "InvalidSessionIdException: Please start a session", "stack": "Traceback (most recent call last):\n File \"/builds/worker/workspace/build/venv/lib/python2.7/site-packages/marionette_harness/marionette_test/testcases.py\", line 190, in run\n self.tearDown()\n File \"/builds/worker/workspace/build/tests/marionette/tests/js/xpconnect/tests/marionette/test_loader_global_sharing.py\", line 77, in tearDown\n self.marionette.restart(clean=True)\n File \"/builds/worker/workspace/build/venv/lib/python2.7/site-packages/marionette_driver/decorators.py\", line 26, in _\n return func(*args, **kwargs)\n File \"/builds/worker/workspace/build/venv/lib/python2.7/site-packages/marionette_driver/marionette.py\", line 1157, in restart\n key=\"value\")\n File \"/builds/worker/workspace/build/venv/lib/python2.7/site-packages/marionette_driver/decorators.py\", line 26, in _\n return func(*args, **kwargs)\n File \"/builds/worker/workspace/build/venv/lib/python2.7/site-packages/marionette_driver/marionette.py\", line 750, in _send_message\n raise errors.InvalidSessionIdException(\"Please start a session\")\n"} [task 2018-10-09T22:03:37.028Z] 22:03:37 INFO - [task 2018-10-09T22:03:37.029Z] 22:03:37 INFO - SUMMARY [task 2018-10-09T22:03:37.031Z] 22:03:37 INFO - ------- [task 2018-10-09T22:03:37.032Z] 22:03:37 INFO - passed: 898 [task 2018-10-09T22:03:37.033Z] 22:03:37 INFO - failed: 2 [task 2018-10-09T22:03:37.034Z] 22:03:37 INFO - todo: 38 (skipped: 35) [task 2018-10-09T22:03:37.035Z] 22:03:37 INFO - [task 2018-10-09T22:03:37.036Z] 22:03:37 INFO - FAILED TESTS [task 2018-10-09T22:03:37.037Z] 22:03:37 INFO - ------- [task 2018-10-09T22:03:37.038Z] 22:03:37 INFO - test_loader_global_sharing.py test_loader_global_sharing.TestLoaderGlobalSharing.test_global_sharing_settings [task 2018-10-09T22:03:37.039Z] 22:03:37 INFO - test_loader_global_sharing.py test_loader_global_sharing.TestLoaderGlobalSharing.test_global_sharing_settings [task 2018-10-09T22:03:37.040Z] 22:03:37 INFO - SUITE-END | took 849s [task 2018-10-09T22:03:37.674Z] 22:03:37 ERROR - Return code: 10 [task 2018-10-09T22:03:37.676Z] 22:03:37 INFO - TinderboxPrint: marionette<br/>936/<em class="testfail">1</em>/2 [task 2018-10-09T22:03:37.676Z] 22:03:37 INFO - gecko.log not found [task 2018-10-09T22:03:37.677Z] 22:03:37 INFO - TinderboxPrint: marionette<br/>936/<em class="testfail">1</em>/2 [task 2018-10-09T22:03:37.677Z] 22:03:37 INFO - Marionette exited with return code 10: FAILURE [task 2018-10-09T22:03:37.678Z] 22:03:37 ERROR - # TBPL FAILURE # [task 2018-10-09T22:03:37.679Z] 22:03:37 WARNING - setting return code to 2
All of those failing tests show a missing "sessionstore-windows-restored" notification.
Depends on: 1382162

This is actually a Linux 32/64 bit only issue. Adjusting the platform flags.

OS: Unspecified → Linux
Hardware: Unspecified → All
Status: NEW → RESOLVED
Closed: 5 years ago
Resolution: --- → INCOMPLETE
You need to log in before you can comment on or make changes to this bug.