Closed
Bug 1500588
Opened 7 years ago
Closed 7 years ago
Intermittent /webdriver/tests/new_session/create_alwaysMatch.py | test_valid[test:extension-False] - AssertionError: unknown error (500): connection refused
Categories
(Remote Protocol :: Marionette, defect, P5)
Tracking
(Not tracked)
RESOLVED
DUPLICATE
of bug 1498944
People
(Reporter: intermittent-bug-filer, Unassigned)
Details
(Keywords: intermittent-failure)
Filed by: archaeopteryx [at] coole-files.de
https://treeherder.mozilla.org/logviewer.html#?job_id=206645299&repo=try
https://queue.taskcluster.net/v1/task/DpJqI6D1Q1-V11sFYO2msQ/runs/0/artifacts/public/logs/live_backing.log
From a central-as-beta simulation:
[task 2018-10-19T16:56:45.067Z] 16:56:45 INFO - PID 29772 | 1539968205061 Marionette DEBUG Remote service is active
[task 2018-10-19T16:56:45.148Z] 16:56:45 INFO - PID 29772 | 1539968205132 geckodriver::marionette DEBUG Connection established on 127.0.0.1:2828. Waiting for Marionette handshake
[task 2018-10-19T16:56:45.151Z] 16:56:45 INFO - PID 29772 | 1539968205138 Marionette DEBUG Accepted connection 0 from 127.0.0.1:41704
[task 2018-10-19T16:56:45.153Z] 16:56:45 INFO - PID 29772 | 1539968205140 geckodriver::marionette DEBUG Connected to Marionette
[task 2018-10-19T16:56:45.162Z] 16:56:45 INFO - PID 29772 | 1539968205153 Marionette TRACE 0 -> [0,1,"WebDriver:NewSession",{"test:extension":{"key":"value"}}]
[task 2018-10-19T16:56:45.341Z] 16:56:45 INFO - PID 29772 | 1539968205338 Marionette DEBUG [4294967297] Frame script loaded
[task 2018-10-19T16:56:45.349Z] 16:56:45 INFO - PID 29772 | 1539968205346 Marionette DEBUG [4294967297] Frame script registered
[task 2018-10-19T16:56:45.372Z] 16:56:45 INFO - PID 29772 | 1539968205364 Marionette TRACE 0 <- [1,1,null,{"sessionId":"cdb0d498-72cd-46b7-a0ba-4cb5ae706632","capabilities":{"browserName":"firefox","browserVersion":"64.0" ... file.4GQ76J8NBnkO","moz:useNonSpecCompliantPointerOrigin":false,"moz:webdriverClick":true,"test:extension":{"key":"value"}}}]
[task 2018-10-19T16:56:45.380Z] 16:56:45 INFO - STDOUT: PASSED
[task 2018-10-19T16:56:45.388Z] 16:56:45 INFO - PID 29772 | 1539968205374 webdriver::server DEBUG <- 200 OK {"value":{"sessionId":"cdb0d498-72cd-46b7-a0ba-4cb5ae706632","capabilities":{"acceptInsecureCerts":false,"browserName":"firefox","browserVersion":"64.0","moz:accessibilityChecks":false,"moz:geckodriverVersion":"0.23.0","moz:headless":false,"moz:processID":2536,"moz:profile":"/tmp/rust_mozprofile.4GQ76J8NBnkO","moz:useNonSpecCompliantPointerOrigin":false,"moz:webdriverClick":true,"pageLoadStrategy":"normal","platformName":"linux","platformVersion":"4.4.0-1014-aws","rotatable":false,"setWindowRect":true,"test:extension":{"key":"value"},"timeouts":{"implicit":0,"pageLoad":300000,"script":30000},"unhandledPromptBehavior":"dismiss and notify"}}}
[task 2018-10-19T16:56:45.388Z] 16:56:45 INFO - PID 29772 | 1539968205377 webdriver::server DEBUG -> DELETE /session/cdb0d498-72cd-46b7-a0ba-4cb5ae706632
[task 2018-10-19T16:56:45.389Z] 16:56:45 INFO - PID 29772 | 1539968205379 Marionette TRACE 0 -> [0,2,"Marionette:Quit",{"flags":["eForceQuit"]}]
[task 2018-10-19T16:56:45.389Z] 16:56:45 INFO - PID 29772 | 1539968205382 Marionette INFO Stopped listening on port 2828
[task 2018-10-19T16:56:45.420Z] 16:56:45 INFO - PID 29772 | JavaScript error: resource://activity-stream/lib/ActivityStreamPrefs.jsm, line 29: NS_ERROR_ILLEGAL_VALUE: Component returned failure code: 0x80070057 (NS_ERROR_ILLEGAL_VALUE) [nsIPrefBranch.removeObserver]
[task 2018-10-19T16:56:45.510Z] 16:56:45 INFO - PID 29772 | 1539968205504 Marionette TRACE 0 <- [1,2,null,{"cause":"shutdown"}]
[task 2018-10-19T16:56:45.607Z] 16:56:45 INFO - PID 29772 | 1539968205604 webdriver::server DEBUG Deleting session
[task 2018-10-19T16:56:45.628Z] 16:56:45 INFO - PID 29772 | 1539968205616 Marionette TRACE 0 -> [0,3,"Marionette:Quit",{"flags":["eForceQuit"]}]
[task 2018-10-19T16:56:45.630Z] 16:56:45 INFO - PID 29772 | 1539968205618 Marionette TRACE 0 <- [1,3,{"error":"invalid session id","message":"Tried to run command without establishing a connection","stacktrace":"WebDriver ... et@chrome://marionette/content/server.js:236:8\n_onJSONObjectReady/<@chrome://marionette/content/transport.js:490:9\n"},null]
[task 2018-10-19T16:56:45.637Z] 16:56:45 INFO - PID 29772 |
[task 2018-10-19T16:56:45.638Z] 16:56:45 INFO - PID 29772 | ###!!! [Parent][RunMessage] Error: Channel closing: too late to send/recv, messages will be lost
[task 2018-10-19T16:56:45.639Z] 16:56:45 INFO - PID 29772 |
[task 2018-10-19T16:56:45.643Z] 16:56:45 INFO - PID 29772 |
[task 2018-10-19T16:56:45.644Z] 16:56:45 INFO - PID 29772 | ###!!! [Parent][RunMessage] Error: Channel closing: too late to send/recv, messages will be lost
[task 2018-10-19T16:56:45.647Z] 16:56:45 INFO - PID 29772 |
[task 2018-10-19T16:56:45.648Z] 16:56:45 INFO - PID 29772 | 1539968205640 Marionette DEBUG Closed connection 0
[task 2018-10-19T16:56:46.211Z] 16:56:46 INFO - PID 29772 | console.error:
[task 2018-10-19T16:56:46.213Z] 16:56:46 INFO - PID 29772 | [Exception... "Component returned failure code: 0x80004005 (NS_ERROR_FAILURE) [nsIAppShellService.hiddenDOMWindow]" nsresult: "0x80004005 (NS_ERROR_FAILURE)" location: "JS frame :: resource://activity-stream/lib/DownloadsManager.jsm :: init :: line 44" data: no]: init@resource://activity-stream/lib/DownloadsManager.jsm:44:5
[task 2018-10-19T16:56:46.214Z] 16:56:46 INFO - PID 29772 | postInit@resource://activity-stream/lib/HighlightsFeed.jsm:60:5
[task 2018-10-19T16:56:46.214Z] 16:56:46 INFO - PID 29772 | handler@resource://gre/modules/EventEmitter.jsm:94:11
[task 2018-10-19T16:56:46.215Z] 16:56:46 INFO - PID 29772 | emit@resource://gre/modules/EventEmitter.jsm:149:11
[task 2018-10-19T16:56:46.216Z] 16:56:46 INFO - PID 29772 | init@resource://activity-stream/lib/SectionsManager.jsm:119:5
[task 2018-10-19T16:56:46.217Z] 16:56:46 INFO - PID 29772 |
[task 2018-10-19T16:56:46.225Z] 16:56:46 INFO - PID 29772 | JavaScript error: resource://activity-stream/lib/PlacesFeed.jsm, line 171: NS_ERROR_UNEXPECTED: Component returned failure code: 0x8000ffff (NS_ERROR_UNEXPECTED) [nsINavHistoryService.addObserver]
[task 2018-10-19T16:56:46.229Z] 16:56:46 INFO - PID 29772 | JavaScript error: resource://gre/modules/IndexedDB.jsm, line 349: UnknownError: The operation failed for reasons unrelated to the database itself and not covered by any other error code.
[task 2018-10-19T16:56:46.250Z] 16:56:46 INFO - PID 29772 | JavaScript error: resource://gre/modules/IndexedDB.jsm, line 349: UnknownError: The operation failed for reasons unrelated to the database itself and not covered by any other error code.
[task 2018-10-19T16:56:46.252Z] 16:56:46 INFO - PID 29772 | JavaScript error: resource://gre/modules/IndexedDB.jsm, line 349: UnknownError: The operation failed for reasons unrelated to the database itself and not covered by any other error code.
[task 2018-10-19T16:56:46.253Z] 16:56:46 INFO - PID 29772 | JavaScript error: resource://gre/modules/Sqlite.jsm, line 841: Error: Connection is not open.
[task 2018-10-19T16:56:46.733Z] 16:56:46 INFO - PID 29772 | 1539968206727 Marionette DEBUG Received observer notification xpcom-will-shutdown
[task 2018-10-19T16:56:46.734Z] 16:56:46 INFO - PID 29772 | 1539968206727 Marionette DEBUG Resetting recommended pref security.turn_off_all_security_so_that_viruses_can_take_over_this_computer
[task 2018-10-19T16:56:46.735Z] 16:56:46 INFO - PID 29772 | 1539968206727 Marionette DEBUG Resetting recommended pref apz.content_response_timeout
[task 2018-10-19T16:56:46.736Z] 16:56:46 INFO - PID 29772 | 1539968206728 Marionette DEBUG Resetting recommended pref browser.download.panel.shown
[task 2018-10-19T16:56:46.736Z] 16:56:46 INFO - PID 29772 | 1539968206728 Marionette DEBUG Resetting recommended pref browser.pagethumbnails.capturing_disabled
[task 2018-10-19T16:56:46.737Z] 16:56:46 INFO - PID 29772 | 1539968206728 Marionette DEBUG Resetting recommended pref browser.search.update
[task 2018-10-19T16:56:46.737Z] 16:56:46 INFO - PID 29772 | 1539968206729 Marionette DEBUG Resetting recommended pref toolkit.cosmeticAnimations.enabled
[task 2018-10-19T16:56:46.738Z] 16:56:46 INFO - PID 29772 | 1539968206730 Marionette DEBUG Resetting recommended pref browser.tabs.disableBackgroundZombification
[task 2018-10-19T16:56:46.738Z] 16:56:46 INFO - PID 29772 | 1539968206730 Marionette DEBUG Resetting recommended pref browser.tabs.warnOnCloseOtherTabs
[task 2018-10-19T16:56:46.739Z] 16:56:46 INFO - PID 29772 | 1539968206730 Marionette DEBUG Resetting recommended pref browser.tabs.warnOnOpen
[task 2018-10-19T16:56:46.740Z] 16:56:46 INFO - PID 29772 | 1539968206731 Marionette DEBUG Resetting recommended pref browser.usedOnWindows10.introURL
[task 2018-10-19T16:56:46.742Z] 16:56:46 INFO - PID 29772 | 1539968206731 Marionette DEBUG Resetting recommended pref browser.urlbar.suggest.searches
[task 2018-10-19T16:56:46.743Z] 16:56:46 INFO - PID 29772 | 1539968206732 Marionette DEBUG Resetting recommended pref datareporting.policy.dataSubmissionPolicyAccepted
[task 2018-10-19T16:56:46.744Z] 16:56:46 INFO - PID 29772 | 1539968206733 Marionette DEBUG Resetting recommended pref dom.disable_beforeunload
[task 2018-10-19T16:56:46.746Z] 16:56:46 INFO - PID 29772 | 1539968206733 Marionette DEBUG Resetting recommended pref dom.disable_open_during_load
[task 2018-10-19T16:56:46.746Z] 16:56:46 INFO - PID 29772 | 1539968206733 Marionette DEBUG Resetting recommended pref dom.file.createInChild
[task 2018-10-19T16:56:46.748Z] 16:56:46 INFO - PID 29772 | 1539968206734 Marionette DEBUG Resetting recommended pref dom.max_chrome_script_run_time
[task 2018-10-19T16:56:46.749Z] 16:56:46 INFO - PID 29772 | 1539968206734 Marionette DEBUG Resetting recommended pref dom.max_script_run_time
[task 2018-10-19T16:56:46.749Z] 16:56:46 INFO - PID 29772 | 1539968206736 Marionette DEBUG Resetting recommended pref extensions.getAddons.cache.enabled
[task 2018-10-19T16:56:46.749Z] 16:56:46 INFO - PID 29772 | 1539968206736 Marionette DEBUG Resetting recommended pref extensions.webservice.discoverURL
[task 2018-10-19T16:56:46.751Z] 16:56:46 INFO - PID 29772 | 1539968206737 Marionette DEBUG Resetting recommended pref network.http.prompt-temp-redirect
[task 2018-10-19T16:56:46.752Z] 16:56:46 INFO - PID 29772 | 1539968206737 Marionette DEBUG Resetting recommended pref network.http.speculative-parallel-limit
[task 2018-10-19T16:56:46.752Z] 16:56:46 INFO - PID 29772 | 1539968206738 Marionette DEBUG Resetting recommended pref security.fileuri.strict_origin_policy
[task 2018-10-19T16:56:46.754Z] 16:56:46 INFO - PID 29772 | 1539968206738 Marionette DEBUG Resetting recommended pref security.notification_enable_delay
[task 2018-10-19T16:56:46.755Z] 16:56:46 INFO - PID 29772 | 1539968206739 Marionette DEBUG Resetting recommended pref signon.autofillForms
[task 2018-10-19T16:56:46.756Z] 16:56:46 INFO - PID 29772 | 1539968206739 Marionette DEBUG Resetting recommended pref signon.rememberSignons
[task 2018-10-19T16:56:46.758Z] 16:56:46 INFO - PID 29772 | 1539968206741 Marionette DEBUG Remote service is inactive
[task 2018-10-19T16:56:47.735Z] 16:56:47 INFO - PID 29772 | 1539968207724 geckodriver::marionette DEBUG Browser process stopped: exit code: 0
[task 2018-10-19T16:56:47.737Z] 16:56:47 INFO - PID 29772 | 1539968207727 webdriver::server DEBUG <- 200 OK {"value":null}
[task 2018-10-19T16:56:47.739Z] 16:56:47 INFO - STDOUT: =================================== FAILURES ===================================
[task 2018-10-19T16:56:47.740Z] 16:56:47 INFO - STDOUT: _______________________ test_valid[test:extension-False] _______________________
[task 2018-10-19T16:56:47.740Z] 16:56:47 INFO - STDOUT: new_session = <function new_session at 0x7f789a6da758>
[task 2018-10-19T16:56:47.741Z] 16:56:47 INFO - STDOUT: add_browser_capabilities = <function add_browser_capabilities at 0x7f788d4f70c8>
[task 2018-10-19T16:56:47.742Z] 16:56:47 INFO - STDOUT: key = 'test:extension', value = False
[task 2018-10-19T16:56:47.743Z] 16:56:47 INFO - STDOUT: @pytest.mark.parametrize("key,value", flatten(product(*item) for item in valid_data))
[task 2018-10-19T16:56:47.743Z] 16:56:47 INFO - STDOUT: def test_valid(new_session, add_browser_capabilities, key, value):
[task 2018-10-19T16:56:47.744Z] 16:56:47 INFO - STDOUT: response, _ = new_session({"capabilities": {
[task 2018-10-19T16:56:47.745Z] 16:56:47 INFO - STDOUT: "alwaysMatch": add_browser_capabilities({key: value})}})
[task 2018-10-19T16:56:47.745Z] 16:56:47 INFO - STDOUT: > assert_success(response)
[task 2018-10-19T16:56:47.746Z] 16:56:47 INFO - STDOUT: _ = None
[task 2018-10-19T16:56:47.747Z] 16:56:47 INFO - STDOUT: add_browser_capabilities = <function add_browser_capabilities at 0x7f788d4f70c8>
[task 2018-10-19T16:56:47.747Z] 16:56:47 INFO - STDOUT: key = 'test:extension'
[task 2018-10-19T16:56:47.748Z] 16:56:47 INFO - STDOUT: new_session = <function new_session at 0x7f789a6da758>
[task 2018-10-19T16:56:47.750Z] 16:56:47 INFO - STDOUT: response = <Response status=500 error=<UnknownErrorException http_status=500>>
[task 2018-10-19T16:56:47.750Z] 16:56:47 INFO - STDOUT: value = False
[task 2018-10-19T16:56:47.751Z] 16:56:47 INFO - STDOUT: tests/web-platform/tests/webdriver/tests/new_session/create_alwaysMatch.py
[task 2018-10-19T16:56:47.752Z] 16:56:47 INFO - STDOUT: :15:
[task 2018-10-19T16:56:47.752Z] 16:56:47 INFO - STDOUT: _ _ _ _ _ _ _ _ _ _ _ _ _ _ _ _ _ _ _ _ _ _ _ _ _ _ _ _ _ _ _ _ _ _ _ _ _ _ _ _
[task 2018-10-19T16:56:47.753Z] 16:56:47 INFO - STDOUT: response = <Response status=500 error=<UnknownErrorException http_status=500>>
[task 2018-10-19T16:56:47.754Z] 16:56:47 INFO - STDOUT: value = None
[task 2018-10-19T16:56:47.755Z] 16:56:47 INFO - STDOUT: def assert_success(response, value=None):
[task 2018-10-19T16:56:47.755Z] 16:56:47 INFO - STDOUT: """
[task 2018-10-19T16:56:47.756Z] 16:56:47 INFO - STDOUT: Verify that the provided webdriver.Response instance described
[task 2018-10-19T16:56:47.757Z] 16:56:47 INFO - STDOUT: a valid error response as defined by `dfn-send-an-error` and
[task 2018-10-19T16:56:47.757Z] 16:56:47 INFO - STDOUT: the provided error code.
[task 2018-10-19T16:56:47.758Z] 16:56:47 INFO - STDOUT:
[task 2018-10-19T16:56:47.759Z] 16:56:47 INFO - STDOUT: :param response: ``webdriver.Response`` instance.
[task 2018-10-19T16:56:47.760Z] 16:56:47 INFO - STDOUT: :param value: Expected value of the response body, if any.
[task 2018-10-19T16:56:47.763Z] 16:56:47 INFO - STDOUT: """
[task 2018-10-19T16:56:47.764Z] 16:56:47 INFO - STDOUT: > assert response.status == 200, str(response.error)
[task 2018-10-19T16:56:47.764Z] 16:56:47 INFO - STDOUT: E AssertionError: unknown error (500): connection refused
[task 2018-10-19T16:56:47.764Z] 16:56:47 INFO - STDOUT: E
[task 2018-10-19T16:56:47.765Z] 16:56:47 INFO - STDOUT: E assert 500 == 200
[task 2018-10-19T16:56:47.765Z] 16:56:47 INFO - STDOUT: E + where 500 = <Response status=500 error=<UnknownErrorException http_status=500>>.status
[task 2018-10-19T16:56:47.766Z] 16:56:47 INFO - STDOUT: response = <Response status=500 error=<UnknownErrorException http_status=500>>
[task 2018-10-19T16:56:47.766Z] 16:56:47 INFO - STDOUT: value = None
[task 2018-10-19T16:56:47.766Z] 16:56:47 INFO - STDOUT: tests/web-platform/tests/webdriver/tests/support/asserts.py
[task 2018-10-19T16:56:47.767Z] 16:56:47 INFO - STDOUT: :62: AssertionError
[task 2018-10-19T16:56:47.767Z] 16:56:47 INFO - STDOUT: =============================== warnings summary ===============================
[task 2018-10-19T16:56:47.768Z] 16:56:47 INFO - STDOUT: <undetermined location>
[task 2018-10-19T16:56:47.768Z] 16:56:47 INFO - STDOUT: Module already imported so cannot be rewritten: mozlog
[task 2018-10-19T16:56:47.768Z] 16:56:47 INFO - STDOUT: -- Docs: http://doc.pytest.org/en/latest/warnings.html
[task 2018-10-19T16:56:47.769Z] 16:56:47 INFO - STDOUT: ============== 1 failed, 23 passed, 1 warnings in 288.62 seconds ===============
[task 2018-10-19T16:56:47.791Z] 16:56:47 INFO -
[task 2018-10-19T16:56:47.791Z] 16:56:47 INFO - TEST-PASS | /webdriver/tests/new_session/create_alwaysMatch.py | test_valid[proxy-None]
[task 2018-10-19T16:56:47.791Z] 16:56:47 INFO - TEST-PASS | /webdriver/tests/new_session/create_alwaysMatch.py | test_valid[timeouts-None]
[task 2018-10-19T16:56:47.792Z] 16:56:47 INFO - TEST-PASS | /webdriver/tests/new_session/create_alwaysMatch.py | test_valid[timeouts-value11]
[task 2018-10-19T16:56:47.792Z] 16:56:47 INFO - TEST-PASS | /webdriver/tests/new_session/create_alwaysMatch.py | test_valid[timeouts-value12]
[task 2018-10-19T16:56:47.792Z] 16:56:47 INFO - TEST-PASS | /webdriver/tests/new_session/create_alwaysMatch.py | test_valid[timeouts-value13]
[task 2018-10-19T16:56:47.792Z] 16:56:47 INFO - TEST-PASS | /webdriver/tests/new_session/create_alwaysMatch.py | test_valid[timeouts-value14]
[task 2018-10-19T16:56:47.793Z] 16:56:47 INFO - TEST-PASS | /webdriver/tests/new_session/create_alwaysMatch.py | test_valid[unhandledPromptBehavior-dismiss]
[task 2018-10-19T16:56:47.794Z] 16:56:47 INFO - TEST-PASS | /webdriver/tests/new_session/create_alwaysMatch.py | test_valid[unhandledPromptBehavior-accept]
[task 2018-10-19T16:56:47.794Z] 16:56:47 INFO - TEST-PASS | /webdriver/tests/new_session/create_alwaysMatch.py | test_valid[unhandledPromptBehavior-None]
[task 2018-10-19T16:56:47.794Z] 16:56:47 INFO - TEST-PASS | /webdriver/tests/new_session/create_alwaysMatch.py | test_valid[test:extension-None]
[task 2018-10-19T16:56:47.794Z] 16:56:47 INFO - TEST-UNEXPECTED-FAIL | /webdriver/tests/new_session/create_alwaysMatch.py | test_valid[test:extension-False] - AssertionError: unknown error (500): connection refused
[task 2018-10-19T16:56:47.794Z] 16:56:47 INFO - new_session = <function new_session at 0x7f789a6da758>
[task 2018-10-19T16:56:47.794Z] 16:56:47 INFO - add_browser_capabilities = <function add_browser_capabilities at 0x7f788d4f70c8>
[task 2018-10-19T16:56:47.794Z] 16:56:47 INFO - key = 'test:extension', value = False
[task 2018-10-19T16:56:47.794Z] 16:56:47 INFO -
[task 2018-10-19T16:56:47.795Z] 16:56:47 INFO - @pytest.mark.parametrize("key,value", flatten(product(*item) for item in valid_data))
[task 2018-10-19T16:56:47.795Z] 16:56:47 INFO - def test_valid(new_session, add_browser_capabilities, key, value):
[task 2018-10-19T16:56:47.795Z] 16:56:47 INFO - response, _ = new_session({"capabilities": {
[task 2018-10-19T16:56:47.795Z] 16:56:47 INFO - "alwaysMatch": add_browser_capabilities({key: value})}})
[task 2018-10-19T16:56:47.795Z] 16:56:47 INFO - > assert_success(response)
[task 2018-10-19T16:56:47.796Z] 16:56:47 INFO -
[task 2018-10-19T16:56:47.796Z] 16:56:47 INFO - _ = None
[task 2018-10-19T16:56:47.797Z] 16:56:47 INFO - add_browser_capabilities = <function add_browser_capabilities at 0x7f788d4f70c8>
[task 2018-10-19T16:56:47.798Z] 16:56:47 INFO - key = 'test:extension'
[task 2018-10-19T16:56:47.798Z] 16:56:47 INFO - new_session = <function new_session at 0x7f789a6da758>
[task 2018-10-19T16:56:47.798Z] 16:56:47 INFO - response = <Response status=500 error=<UnknownErrorException http_status=500>>
[task 2018-10-19T16:56:47.798Z] 16:56:47 INFO - value = False
[task 2018-10-19T16:56:47.798Z] 16:56:47 INFO -
[task 2018-10-19T16:56:47.798Z] 16:56:47 INFO - tests/web-platform/tests/webdriver/tests/new_session/create_alwaysMatch.py:15:
[task 2018-10-19T16:56:47.799Z] 16:56:47 INFO - _ _ _ _ _ _ _ _ _ _ _ _ _ _ _ _ _ _ _ _ _ _ _ _ _ _ _ _ _ _ _ _ _ _ _ _ _ _ _ _
[task 2018-10-19T16:56:47.799Z] 16:56:47 INFO -
[task 2018-10-19T16:56:47.800Z] 16:56:47 INFO - response = <Response status=500 error=<UnknownErrorException http_status=500>>
[task 2018-10-19T16:56:47.800Z] 16:56:47 INFO - value = None
[task 2018-10-19T16:56:47.800Z] 16:56:47 INFO -
[task 2018-10-19T16:56:47.801Z] 16:56:47 INFO - def assert_success(response, value=None):
[task 2018-10-19T16:56:47.801Z] 16:56:47 INFO - """
[task 2018-10-19T16:56:47.802Z] 16:56:47 INFO - Verify that the provided webdriver.Response instance described
[task 2018-10-19T16:56:47.802Z] 16:56:47 INFO - a valid error response as defined by `dfn-send-an-error` and
[task 2018-10-19T16:56:47.802Z] 16:56:47 INFO - the provided error code.
[task 2018-10-19T16:56:47.803Z] 16:56:47 INFO -
[task 2018-10-19T16:56:47.803Z] 16:56:47 INFO - :param response: ``webdriver.Response`` instance.
[task 2018-10-19T16:56:47.804Z] 16:56:47 INFO - :param value: Expected value of the response body, if any.
[task 2018-10-19T16:56:47.805Z] 16:56:47 INFO - """
[task 2018-10-19T16:56:47.808Z] 16:56:47 INFO - > assert response.status == 200, str(response.error)
[task 2018-10-19T16:56:47.808Z] 16:56:47 INFO - E AssertionError: unknown error (500): connection refused
[task 2018-10-19T16:56:47.808Z] 16:56:47 INFO - E
[task 2018-10-19T16:56:47.808Z] 16:56:47 INFO - E assert 500 == 200
[task 2018-10-19T16:56:47.809Z] 16:56:47 INFO - E + where 500 = <Response status=500 error=<UnknownErrorException http_status=500>>.status
[task 2018-10-19T16:56:47.809Z] 16:56:47 INFO -
[task 2018-10-19T16:56:47.809Z] 16:56:47 INFO - response = <Response status=500 error=<UnknownErrorException http_status=500>>
[task 2018-10-19T16:56:47.810Z] 16:56:47 INFO - value = None
[task 2018-10-19T16:56:47.810Z] 16:56:47 INFO -
[task 2018-10-19T16:56:47.810Z] 16:56:47 INFO - tests/web-platform/tests/webdriver/tests/support/asserts.py:62: AssertionError
[task 2018-10-19T16:56:47.810Z] 16:56:47 INFO - ....
[task 2018-10-19T16:56:47.810Z] 16:56:47 INFO - TEST-OK | /webdriver/tests/new_session/create_alwaysMatch.py | took 288998ms
[task 2018-10-19T16:56:47.896Z] 16:56:47 INFO - Closing logging queue
Comment 1•7 years ago
|
||
Missing `sessionstore-windows-restored` notification:
> [task 2018-10-19T16:55:13.410Z] 16:55:13 INFO - PID 29772 | 1539968113399 Marionette DEBUG Received observer notification toplevel-window-ready
> [task 2018-10-19T16:56:10.664Z] 16:56:10 INFO - PID 29772 | 1539968170654 mozrunner::runner DEBUG Killing process 1676
> [task 2018-10-19T16:56:10.680Z] 16:56:10 INFO - PID 29772 | 1539968170672 webdriver::server DEBUG <- 500 Internal Server Error {"value":{"error":"unknown error","message":"connection refused","stacktrace":""}}
Status: NEW → RESOLVED
Closed: 7 years ago
Resolution: --- → DUPLICATE
| Comment hidden (Intermittent Failures Robot) |
Comment 3•3 years ago
|
||
Moving bug to Remote Protocol::Marionette component per bug 1815831.
Component: geckodriver → Marionette
Product: Testing → Remote Protocol
You need to log in
before you can comment on or make changes to this bug.
Description
•