Convert about:devtools to use Fluent

RESOLVED FIXED in Firefox 65

Status

enhancement
P3
normal
RESOLVED FIXED
6 months ago
6 months ago

People

(Reporter: masterkrombi, Assigned: masterkrombi)

Tracking

(Blocks 1 bug)

65 Branch
Firefox 65
Dependency tree / graph

Firefox Tracking Flags

(firefox65 fixed)

Details

Attachments

(1 attachment)

(Assignee)

Description

6 months ago
User Agent: Mozilla/5.0 (Windows NT 10.0; Win64; x64) AppleWebKit/537.36 (KHTML, like Gecko) Chrome/69.0.3497.100 Safari/537.36
Assignee: nobody → masterkrombi
Blocks: 1486917
Status: UNCONFIRMED → ASSIGNED
Ever confirmed: true
Severity: normal → enhancement
Priority: -- → P3
Blocks: 1504457

Comment 2

6 months ago
Pushed by jwein@mozilla.com:
https://hg.mozilla.org/integration/autoland/rev/22b989a6c91d
Convert about:devtools to use Fluent r=flod,jaws,zbraniecki
Backed out for build bustages

push with failures: https://treeherder.mozilla.org/#/jobs?repo=autoland&resultStatus=testfailed%2Cbusted%2Cexception&group_state=expanded&revision=22b989a6c91df9d28acbcdb388f32a10867556ec&selectedJob=210113615

Failure log: https://treeherder.mozilla.org/logviewer.html#?job_id=210113615&repo=autoland&lineNumber=41456

[task 2018-11-06T17:03:03.081Z] 17:03:03     INFO -  l10n-check> RuntimeError: File "aboutDevTools.ftl" not found in /builds/worker/workspace/build/src/obj-firefox/browser/locales/merge-dir/x-test/devtools/startup, /builds/worker/workspace/build/src/obj-firefox/browser/locales/x-test/devtools/startup
[task 2018-11-06T17:03:03.081Z] 17:03:03     INFO -  l10n-check> /builds/worker/workspace/build/src/config/rules.mk:1330: recipe for target 'libs' failed
[task 2018-11-06T17:03:03.081Z] 17:03:03     INFO -  l10n-check> make[7]: *** [libs] Error 1
[task 2018-11-06T17:03:03.081Z] 17:03:03     INFO -  l10n-check> make[7]: Leaving directory '/builds/worker/workspace/build/src/obj-firefox/devtools/startup/locales'
[task 2018-11-06T17:03:03.081Z] 17:03:03     INFO -  l10n-check> /builds/worker/workspace/build/src/config/rules.mk:431: recipe for target 'default' failed
[task 2018-11-06T17:03:03.081Z] 17:03:03     INFO -  l10n-check> make[6]: *** [default] Error 2
[task 2018-11-06T17:03:03.081Z] 17:03:03     INFO -  l10n-check> Makefile:61: recipe for target 'libs-x-test' failed
[task 2018-11-06T17:03:03.081Z] 17:03:03     INFO -  l10n-check> make[5]: *** [libs-x-test] Error 2
[task 2018-11-06T17:03:03.081Z] 17:03:03     INFO -  l10n-check> Makefile:105: recipe for target 'installers-x-test' failed
[task 2018-11-06T17:03:03.081Z] 17:03:03     INFO -  l10n-check> make[4]: *** [installers-x-test] Error 2
[task 2018-11-06T17:03:03.081Z] 17:03:03     INFO -  l10n-check> Makefile:126: recipe for target 'l10n-check' failed
[task 2018-11-06T17:03:03.081Z] 17:03:03     INFO -  l10n-check> make[3]: *** [l10n-check] Error 2
[task 2018-11-06T17:03:03.082Z] 17:03:03     INFO -  l10n-check> /builds/worker/workspace/build/src/browser/build.mk:36: recipe for target 'l10n-check' failed
[task 2018-11-06T17:03:03.082Z] 17:03:03     INFO -  l10n-check> make[2]: *** [l10n-check] Error 2
[task 2018-11-06T17:03:03.082Z] 17:03:03     INFO -  /builds/worker/workspace/build/src/build/moz-automation.mk:84: recipe for target 'automation/l10n-check' failed
[task 2018-11-06T17:03:03.082Z] 17:03:03     INFO -  make[1]: *** [automation/l10n-check] Error 2
[task 2018-11-06T17:03:03.082Z] 17:03:03     INFO -  make[1]: *** Waiting for unfinished jobs....
[task 2018-11-06T17:04:26.735Z] 17:04:26     INFO -  package-tests> make[2]: Entering directory '/builds/worker/workspace/build/src/obj-firefox'
[task 2018-11-06T17:04:26.736Z] 17:04:26     INFO -  package-tests> /builds/worker/workspace/build/src/obj-firefox/_virtualenvs/init/bin/python -m mozbuild.action.download_wpt_manifest
[task 2018-11-06T17:04:26.736Z] 17:04:26     INFO -  package-tests> Downloading wpt manifest

Backout: https://hg.mozilla.org/integration/autoland/rev/2f15ccbf77a6bf615fe880ab2044fe96d9021381
Flags: needinfo?(masterkrombi)

Comment 4

6 months ago
Pushed by jwein@mozilla.com:
https://hg.mozilla.org/integration/mozilla-inbound/rev/445e333886a9
Convert about:devtools to use Fluent r=flod,jaws,zbraniecki
Flags: needinfo?(masterkrombi)

Comment 5

6 months ago
bugherder
https://hg.mozilla.org/mozilla-central/rev/445e333886a9
Status: ASSIGNED → RESOLVED
Last Resolved: 6 months ago
Resolution: --- → FIXED
Target Milestone: --- → Firefox 65
You need to log in before you can comment on or make changes to this bug.