Closed Bug 1514587 Opened 3 years ago Closed 3 years ago

Permafailing bustage on src/js/src/builtin/Symbol.cpp:68:13: error: no match for 'operator==' (operand types are 'size_t {aka long unsigned int}' and 'JS::SymbolCode')

Categories

(Core :: JavaScript Engine, defect)

defect
Not set
normal

Tracking

()

VERIFIED FIXED
mozilla66
Tracking Status
firefox-esr60 --- unaffected
firefox64 --- unaffected
firefox65 --- unaffected
firefox66 + verified

People

(Reporter: nataliaCs, Assigned: anba)

References

Details

Attachments

(1 file)

[Tracking Requested - why for this release]:
Central as Beta:
https://treeherder.mozilla.org/#/jobs?repo=try&resultStatus=testfailed%2Cbusted%2Cexception%2Crunnable&revision=30d794bae10230b70ec726e6339a54c8f6070d79&selectedJob=217295201

Failure log: https://treeherder.mozilla.org/logviewer.html#/jobs?job_id=217295224&repo=try&lineNumber=1370

[task 2018-12-16T14:13:45.975Z]      Running `/builds/worker/workspace/rustc/bin/rustc --crate-name regex /builds/worker/workspace/build/src/third_party/rust/regex/src/lib.rs --color never --crate-type lib --emit=dep-info,link -C opt-level=1 -C debuginfo=2 -C debug-assertions=on --cfg 'feature="default"' --cfg 'feature="use_std"' -C metadata=4c5783f125445054 -C extra-filename=-4c5783f125445054 --out-dir /builds/worker/workspace/build/src/obj-spider/js/src/frontend/binsource/./debug/deps -L dependency=/builds/worker/workspace/build/src/obj-spider/js/src/frontend/binsource/./debug/deps --extern aho_corasick=/builds/worker/workspace/build/src/obj-spider/js/src/frontend/binsource/./debug/deps/libaho_corasick-0fe151aec1bca5f5.rlib --extern memchr=/builds/worker/workspace/build/src/obj-spider/js/src/frontend/binsource/./debug/deps/libmemchr-f8aafc3884a510e0.rlib --extern regex_syntax=/builds/worker/workspace/build/src/obj-spider/js/src/frontend/binsource/./debug/deps/libregex_syntax-919bfa10f65ab399.rlib --extern thread_local=/builds/worker/workspace/build/src/obj-spider/js/src/frontend/binsource/./debug/deps/libthread_local-f0877edf562adcce.rlib --extern utf8_ranges=/builds/worker/workspace/build/src/obj-spider/js/src/frontend/binsource/./debug/deps/libutf8_ranges-b563dca8ce186e2d.rlib --cap-lints warn`
[task 2018-12-16T14:13:46.016Z] make[3]: Entering directory '/builds/worker/workspace/build/src/obj-spider/mozglue/misc'
[task 2018-12-16T14:13:46.016Z] mkdir -p '.deps/'
[task 2018-12-16T14:13:46.018Z] /builds/worker/workspace/gcc/bin/g++ -o AutoProfilerLabel.o -c  -I/builds/worker/workspace/build/src/obj-spider/dist/system_wrappers -include /builds/worker/workspace/build/src/config/gcc_hidden.h -DDEBUG=1 -DIMPL_MFBT -DMOZ_HAS_MOZGLUE -I/builds/worker/workspace/build/src/mozglue/misc -I/builds/worker/workspace/build/src/obj-spider/mozglue/misc -I/builds/worker/workspace/build/src/obj-spider/dist/include -I/builds/worker/workspace/build/src/obj-spider/dist/include/nspr -fPIC -DMOZILLA_CLIENT -include /builds/worker/workspace/build/src/obj-spider/js/src/js-confdefs.h -U_FORTIFY_SOURCE -D_FORTIFY_SOURCE=2 -Wall -Wempty-body -Wignored-qualifiers -Woverloaded-virtual -Wpointer-arith -Wsign-compare -Wtype-limits -Wunreachable-code -Wwrite-strings -Wno-invalid-offsetof -Wduplicated-cond -Wno-error=maybe-uninitialized -Wno-error=deprecated-declarations -Wno-error=array-bounds -Wno-error=free-nonheap-object -Wformat -D_GLIBCXX_USE_CXX11_ABI=0 -fno-sized-deallocation -U_FORTIFY_SOURCE -D_FORTIFY_SOURCE=2 -fno-rtti -ffunction-sections -fdata-sections -fno-exceptions -fno-math-errno -pthread -pipe -g -freorder-blocks -O3 -fno-omit-frame-pointer -funwind-tables -Werror  -MD -MP -MF .deps/AutoProfilerLabel.o.pp   /builds/worker/workspace/build/src/mozglue/misc/AutoProfilerLabel.cpp
[task 2018-12-16T14:13:46.084Z] /builds/worker/workspace/gcc/bin/g++ -o ConditionVariable_posix.o -c  -I/builds/worker/workspace/build/src/obj-spider/dist/system_wrappers -include /builds/worker/workspace/build/src/config/gcc_hidden.h -DDEBUG=1 -DIMPL_MFBT -DMOZ_HAS_MOZGLUE -I/builds/worker/workspace/build/src/mozglue/misc -I/builds/worker/workspace/build/src/obj-spider/mozglue/misc -I/builds/worker/workspace/build/src/obj-spider/dist/include -I/builds/worker/workspace/build/src/obj-spider/dist/include/nspr -fPIC -DMOZILLA_CLIENT -include /builds/worker/workspace/build/src/obj-spider/js/src/js-confdefs.h -U_FORTIFY_SOURCE -D_FORTIFY_SOURCE=2 -Wall -Wempty-body -Wignored-qualifiers -Woverloaded-virtual -Wpointer-arith -Wsign-compare -Wtype-limits -Wunreachable-code -Wwrite-strings -Wno-invalid-offsetof -Wduplicated-cond -Wno-error=maybe-uninitialized -Wno-error=deprecated-declarations -Wno-error=array-bounds -Wno-error=free-nonheap-object -Wformat -D_GLIBCXX_USE_CXX11_ABI=0 -fno-sized-deallocation -U_FORTIFY_SOURCE -D_FORTIFY_SOURCE=2 -fno-rtti -ffunction-sections -fdata-sections -fno-exceptions -fno-math-errno -pthread -pipe -g -freorder-blocks -O3 -fno-omit-frame-pointer -funwind-tables -Werror  -MD -MP -MF .deps/ConditionVariable_posix.o.pp   /builds/worker/workspace/build/src/mozglue/misc/ConditionVariable_posix.cpp
[task 2018-12-16T14:13:46.135Z] /builds/worker/workspace/gcc/bin/g++ -o Unified_cpp_js_src_jit5.o -c  -I/builds/worker/workspace/build/src/obj-spider/dist/system_wrappers -include /builds/worker/workspace/build/src/config/gcc_hidden.h -DDEBUG=1 -DWASM_HUGE_MEMORY -DJS_CACHEIR_SPEW -DJS_STRUCTURED_SPEW -DJS_HAS_CTYPES -DFFI_BUILDING -DEXPORT_JS_API -DMOZ_HAS_MOZGLUE -I/builds/worker/workspace/build/src/js/src/jit -I/builds/worker/workspace/build/src/obj-spider/js/src/jit -I/builds/worker/workspace/build/src/obj-spider/js/src -I/builds/worker/workspace/build/src/js/src -I/builds/worker/workspace/build/src/obj-spider/dist/include -I/builds/worker/workspace/build/src/obj-spider/dist/include/nspr -fPIC -DMOZILLA_CLIENT -include /builds/worker/workspace/build/src/obj-spider/js/src/js-confdefs.h -U_FORTIFY_SOURCE -D_FORTIFY_SOURCE=2 -Wall -Wempty-body -Wignored-qualifiers -Woverloaded-virtual -Wpointer-arith -Wsign-compare -Wtype-limits -Wunreachable-code -Wwrite-strings -Wno-invalid-offsetof -Wduplicated-cond -Wno-error=maybe-uninitialized -Wno-error=deprecated-declarations -Wno-error=array-bounds -Wno-error=free-nonheap-object -Wformat -D_GLIBCXX_USE_CXX11_ABI=0 -fno-sized-deallocation -U_FORTIFY_SOURCE -D_FORTIFY_SOURCE=2 -fno-rtti -ffunction-sections -fdata-sections -fno-exceptions -fno-math-errno -pthread -pipe -g -freorder-blocks -O3 -fno-omit-frame-pointer -funwind-tables -Werror -fno-strict-aliasing -Werror=format -Wno-shadow  -MD -MP -MF .deps/Unified_cpp_js_src_jit5.o.pp   /builds/worker/workspace/build/src/obj-spider/js/src/jit/Unified_cpp_js_src_jit5.cpp
[task 2018-12-16T14:13:46.457Z] /builds/worker/workspace/gcc/bin/g++ -o Mutex_posix.o -c  -I/builds/worker/workspace/build/src/obj-spider/dist/system_wrappers -include /builds/worker/workspace/build/src/config/gcc_hidden.h -DDEBUG=1 -DIMPL_MFBT -DMOZ_HAS_MOZGLUE -I/builds/worker/workspace/build/src/mozglue/misc -I/builds/worker/workspace/build/src/obj-spider/mozglue/misc -I/builds/worker/workspace/build/src/obj-spider/dist/include -I/builds/worker/workspace/build/src/obj-spider/dist/include/nspr -fPIC -DMOZILLA_CLIENT -include /builds/worker/workspace/build/src/obj-spider/js/src/js-confdefs.h -U_FORTIFY_SOURCE -D_FORTIFY_SOURCE=2 -Wall -Wempty-body -Wignored-qualifiers -Woverloaded-virtual -Wpointer-arith -Wsign-compare -Wtype-limits -Wunreachable-code -Wwrite-strings -Wno-invalid-offsetof -Wduplicated-cond -Wno-error=maybe-uninitialized -Wno-error=deprecated-declarations -Wno-error=array-bounds -Wno-error=free-nonheap-object -Wformat -D_GLIBCXX_USE_CXX11_ABI=0 -fno-sized-deallocation -U_FORTIFY_SOURCE -D_FORTIFY_SOURCE=2 -fno-rtti -ffunction-sections -fdata-sections -fno-exceptions -fno-math-errno -pthread -pipe -g -freorder-blocks -O3 -fno-omit-frame-pointer -funwind-tables -Werror  -MD -MP -MF .deps/Mutex_posix.o.pp   /builds/worker/workspace/build/src/mozglue/misc/Mutex_posix.cpp
[task 2018-12-16T14:13:46.493Z] /builds/worker/workspace/gcc/bin/g++ -o Printf.o -c  -I/builds/worker/workspace/build/src/obj-spider/dist/system_wrappers -include /builds/worker/workspace/build/src/config/gcc_hidden.h -DDEBUG=1 -DIMPL_MFBT -DMOZ_HAS_MOZGLUE -I/builds/worker/workspace/build/src/mozglue/misc -I/builds/worker/workspace/build/src/obj-spider/mozglue/misc -I/builds/worker/workspace/build/src/obj-spider/dist/include -I/builds/worker/workspace/build/src/obj-spider/dist/include/nspr -fPIC -DMOZILLA_CLIENT -include /builds/worker/workspace/build/src/obj-spider/js/src/js-confdefs.h -U_FORTIFY_SOURCE -D_FORTIFY_SOURCE=2 -Wall -Wempty-body -Wignored-qualifiers -Woverloaded-virtual -Wpointer-arith -Wsign-compare -Wtype-limits -Wunreachable-code -Wwrite-strings -Wno-invalid-offsetof -Wduplicated-cond -Wno-error=maybe-uninitialized -Wno-error=deprecated-declarations -Wno-error=array-bounds -Wno-error=free-nonheap-object -Wformat -D_GLIBCXX_USE_CXX11_ABI=0 -fno-sized-deallocation -U_FORTIFY_SOURCE -D_FORTIFY_SOURCE=2 -fno-rtti -ffunction-sections -fdata-sections -fno-exceptions -fno-math-errno -pthread -pipe -g -freorder-blocks -O3 -fno-omit-frame-pointer -funwind-tables -Werror  -MD -MP -MF .deps/Printf.o.pp   /builds/worker/workspace/build/src/mozglue/misc/Printf.cpp
[task 2018-12-16T14:13:46.782Z] /builds/worker/workspace/gcc/bin/g++ -o Unified_cpp_js_src18.o -c  -I/builds/worker/workspace/build/src/obj-spider/dist/system_wrappers -include /builds/worker/workspace/build/src/config/gcc_hidden.h -DDEBUG=1 -DWASM_HUGE_MEMORY -DJS_CACHEIR_SPEW -DJS_STRUCTURED_SPEW -DJS_HAS_CTYPES -DFFI_BUILDING -DEXPORT_JS_API -DMOZ_HAS_MOZGLUE -I/builds/worker/workspace/build/src/js/src -I/builds/worker/workspace/build/src/obj-spider/js/src -I/builds/worker/workspace/build/src/obj-spider/js/src/ctypes/libffi/include -I/builds/worker/workspace/build/src/js/src/ctypes/libffi/src/x86 -I/builds/worker/workspace/build/src/obj-spider/dist/include -I/builds/worker/workspace/build/src/obj-spider/dist/include/nspr -fPIC -DMOZILLA_CLIENT -include /builds/worker/workspace/build/src/obj-spider/js/src/js-confdefs.h -U_FORTIFY_SOURCE -D_FORTIFY_SOURCE=2 -Wall -Wempty-body -Wignored-qualifiers -Woverloaded-virtual -Wpointer-arith -Wsign-compare -Wtype-limits -Wunreachable-code -Wwrite-strings -Wno-invalid-offsetof -Wduplicated-cond -Wno-error=maybe-uninitialized -Wno-error=deprecated-declarations -Wno-error=array-bounds -Wno-error=free-nonheap-object -Wformat -D_GLIBCXX_USE_CXX11_ABI=0 -fno-sized-deallocation -U_FORTIFY_SOURCE -D_FORTIFY_SOURCE=2 -fno-rtti -ffunction-sections -fdata-sections -fno-exceptions -fno-math-errno -pthread -pipe -g -freorder-blocks -O3 -fno-omit-frame-pointer -funwind-tables -Werror -fno-strict-aliasing -Werror=format -Wno-shadow  -MD -MP -MF .deps/Unified_cpp_js_src18.o.pp   /builds/worker/workspace/build/src/obj-spider/js/src/Unified_cpp_js_src18.cpp
[task 2018-12-16T14:13:46.812Z] /builds/worker/workspace/gcc/bin/g++ -o Unified_cpp_js_src19.o -c  -I/builds/worker/workspace/build/src/obj-spider/dist/system_wrappers -include /builds/worker/workspace/build/src/config/gcc_hidden.h -DDEBUG=1 -DWASM_HUGE_MEMORY -DJS_CACHEIR_SPEW -DJS_STRUCTURED_SPEW -DJS_HAS_CTYPES -DFFI_BUILDING -DEXPORT_JS_API -DMOZ_HAS_MOZGLUE -I/builds/worker/workspace/build/src/js/src -I/builds/worker/workspace/build/src/obj-spider/js/src -I/builds/worker/workspace/build/src/obj-spider/js/src/ctypes/libffi/include -I/builds/worker/workspace/build/src/js/src/ctypes/libffi/src/x86 -I/builds/worker/workspace/build/src/obj-spider/dist/include -I/builds/worker/workspace/build/src/obj-spider/dist/include/nspr -fPIC -DMOZILLA_CLIENT -include /builds/worker/workspace/build/src/obj-spider/js/src/js-confdefs.h -U_FORTIFY_SOURCE -D_FORTIFY_SOURCE=2 -Wall -Wempty-body -Wignored-qualifiers -Woverloaded-virtual -Wpointer-arith -Wsign-compare -Wtype-limits -Wunreachable-code -Wwrite-strings -Wno-invalid-offsetof -Wduplicated-cond -Wno-error=maybe-uninitialized -Wno-error=deprecated-declarations -Wno-error=array-bounds -Wno-error=free-nonheap-object -Wformat -D_GLIBCXX_USE_CXX11_ABI=0 -fno-sized-deallocation -U_FORTIFY_SOURCE -D_FORTIFY_SOURCE=2 -fno-rtti -ffunction-sections -fdata-sections -fno-exceptions -fno-math-errno -pthread -pipe -g -freorder-blocks -O3 -fno-omit-frame-pointer -funwind-tables -Werror -fno-strict-aliasing -Werror=format -Wno-shadow  -MD -MP -MF .deps/Unified_cpp_js_src19.o.pp   /builds/worker/workspace/build/src/obj-spider/js/src/Unified_cpp_js_src19.cpp
[task 2018-12-16T14:13:46.952Z] /builds/worker/workspace/gcc/bin/g++ -o StackWalk.o -c  -I/builds/worker/workspace/build/src/obj-spider/dist/system_wrappers -include /builds/worker/workspace/build/src/config/gcc_hidden.h -DDEBUG=1 -DIMPL_MFBT -DMOZ_HAS_MOZGLUE -I/builds/worker/workspace/build/src/mozglue/misc -I/builds/worker/workspace/build/src/obj-spider/mozglue/misc -I/builds/worker/workspace/build/src/obj-spider/dist/include -I/builds/worker/workspace/build/src/obj-spider/dist/include/nspr -fPIC -DMOZILLA_CLIENT -include /builds/worker/workspace/build/src/obj-spider/js/src/js-confdefs.h -U_FORTIFY_SOURCE -D_FORTIFY_SOURCE=2 -Wall -Wempty-body -Wignored-qualifiers -Woverloaded-virtual -Wpointer-arith -Wsign-compare -Wtype-limits -Wunreachable-code -Wwrite-strings -Wno-invalid-offsetof -Wduplicated-cond -Wno-error=maybe-uninitialized -Wno-error=deprecated-declarations -Wno-error=array-bounds -Wno-error=free-nonheap-object -Wformat -D_GLIBCXX_USE_CXX11_ABI=0 -fno-sized-deallocation -U_FORTIFY_SOURCE -D_FORTIFY_SOURCE=2 -fno-rtti -ffunction-sections -fdata-sections -fno-exceptions -fno-math-errno -pthread -pipe -g -freorder-blocks -O3 -fno-omit-frame-pointer -funwind-tables -Werror  -MD -MP -MF .deps/StackWalk.o.pp   /builds/worker/workspace/build/src/mozglue/misc/StackWalk.cpp
[task 2018-12-16T14:13:47.072Z] /builds/worker/workspace/gcc/bin/g++ -o TimeStamp.o -c  -I/builds/worker/workspace/build/src/obj-spider/dist/system_wrappers -include /builds/worker/workspace/build/src/config/gcc_hidden.h -DDEBUG=1 -DIMPL_MFBT -DMOZ_HAS_MOZGLUE -I/builds/worker/workspace/build/src/mozglue/misc -I/builds/worker/workspace/build/src/obj-spider/mozglue/misc -I/builds/worker/workspace/build/src/obj-spider/dist/include -I/builds/worker/workspace/build/src/obj-spider/dist/include/nspr -fPIC -DMOZILLA_CLIENT -include /builds/worker/workspace/build/src/obj-spider/js/src/js-confdefs.h -U_FORTIFY_SOURCE -D_FORTIFY_SOURCE=2 -Wall -Wempty-body -Wignored-qualifiers -Woverloaded-virtual -Wpointer-arith -Wsign-compare -Wtype-limits -Wunreachable-code -Wwrite-strings -Wno-invalid-offsetof -Wduplicated-cond -Wno-error=maybe-uninitialized -Wno-error=deprecated-declarations -Wno-error=array-bounds -Wno-error=free-nonheap-object -Wformat -D_GLIBCXX_USE_CXX11_ABI=0 -fno-sized-deallocation -U_FORTIFY_SOURCE -D_FORTIFY_SOURCE=2 -fno-rtti -ffunction-sections -fdata-sections -fno-exceptions -fno-math-errno -pthread -pipe -g -freorder-blocks -O3 -fno-omit-frame-pointer -funwind-tables -Werror  -MD -MP -MF .deps/TimeStamp.o.pp   /builds/worker/workspace/build/src/mozglue/misc/TimeStamp.cpp
[task 2018-12-16T14:13:47.443Z] /builds/worker/workspace/gcc/bin/g++ -o TimeStamp_posix.o -c  -I/builds/worker/workspace/build/src/obj-spider/dist/system_wrappers -include /builds/worker/workspace/build/src/config/gcc_hidden.h -DDEBUG=1 -DIMPL_MFBT -DMOZ_HAS_MOZGLUE -I/builds/worker/workspace/build/src/mozglue/misc -I/builds/worker/workspace/build/src/obj-spider/mozglue/misc -I/builds/worker/workspace/build/src/obj-spider/dist/include -I/builds/worker/workspace/build/src/obj-spider/dist/include/nspr -fPIC -DMOZILLA_CLIENT -include /builds/worker/workspace/build/src/obj-spider/js/src/js-confdefs.h -U_FORTIFY_SOURCE -D_FORTIFY_SOURCE=2 -Wall -Wempty-body -Wignored-qualifiers -Woverloaded-virtual -Wpointer-arith -Wsign-compare -Wtype-limits -Wunreachable-code -Wwrite-strings -Wno-invalid-offsetof -Wduplicated-cond -Wno-error=maybe-uninitialized -Wno-error=deprecated-declarations -Wno-error=array-bounds -Wno-error=free-nonheap-object -Wformat -D_GLIBCXX_USE_CXX11_ABI=0 -fno-sized-deallocation -U_FORTIFY_SOURCE -D_FORTIFY_SOURCE=2 -fno-rtti -ffunction-sections -fdata-sections -fno-exceptions -fno-math-errno -pthread -pipe -g -freorder-blocks -O3 -fno-omit-frame-pointer -funwind-tables -Werror  -MD -MP -MF .deps/TimeStamp_posix.o.pp   /builds/worker/workspace/build/src/mozglue/misc/TimeStamp_posix.cpp
[task 2018-12-16T14:13:47.753Z] make[3]: Leaving directory '/builds/worker/workspace/build/src/obj-spider/mozglue/misc'
[task 2018-12-16T14:13:47.753Z] /builds/worker/workspace/gcc/bin/g++ -o Unified_cpp_js_src2.o -c  -I/builds/worker/workspace/build/src/obj-spider/dist/system_wrappers -include /builds/worker/workspace/build/src/config/gcc_hidden.h -DDEBUG=1 -DWASM_HUGE_MEMORY -DJS_CACHEIR_SPEW -DJS_STRUCTURED_SPEW -DJS_HAS_CTYPES -DFFI_BUILDING -DEXPORT_JS_API -DMOZ_HAS_MOZGLUE -I/builds/worker/workspace/build/src/js/src -I/builds/worker/workspace/build/src/obj-spider/js/src -I/builds/worker/workspace/build/src/obj-spider/js/src/ctypes/libffi/include -I/builds/worker/workspace/build/src/js/src/ctypes/libffi/src/x86 -I/builds/worker/workspace/build/src/obj-spider/dist/include -I/builds/worker/workspace/build/src/obj-spider/dist/include/nspr -fPIC -DMOZILLA_CLIENT -include /builds/worker/workspace/build/src/obj-spider/js/src/js-confdefs.h -U_FORTIFY_SOURCE -D_FORTIFY_SOURCE=2 -Wall -Wempty-body -Wignored-qualifiers -Woverloaded-virtual -Wpointer-arith -Wsign-compare -Wtype-limits -Wunreachable-code -Wwrite-strings -Wno-invalid-offsetof -Wduplicated-cond -Wno-error=maybe-uninitialized -Wno-error=deprecated-declarations -Wno-error=array-bounds -Wno-error=free-nonheap-object -Wformat -D_GLIBCXX_USE_CXX11_ABI=0 -fno-sized-deallocation -U_FORTIFY_SOURCE -D_FORTIFY_SOURCE=2 -fno-rtti -ffunction-sections -fdata-sections -fno-exceptions -fno-math-errno -pthread -pipe -g -freorder-blocks -O3 -fno-omit-frame-pointer -funwind-tables -Werror -fno-strict-aliasing -Werror=format -Wno-shadow  -MD -MP -MF .deps/Unified_cpp_js_src2.o.pp   /builds/worker/workspace/build/src/obj-spider/js/src/Unified_cpp_js_src2.cpp
[task 2018-12-16T14:13:50.799Z] In file included from /builds/worker/workspace/build/src/obj-spider/js/src/Unified_cpp_js_src2.cpp:29:0:
[task 2018-12-16T14:13:50.799Z] /builds/worker/workspace/build/src/js/src/builtin/Symbol.cpp: In static member function 'static JSObject* js::SymbolObject::initClass(JSContext*, JS::Handle<js::GlobalObject*>, bool)':
[task 2018-12-16T14:13:50.799Z] /builds/worker/workspace/build/src/js/src/builtin/Symbol.cpp:68:13: error: no match for 'operator==' (operand types are 'size_t {aka long unsigned int}' and 'JS::SymbolCode')
[task 2018-12-16T14:13:50.799Z]        if (i == SymbolCode::matchAll) {
[task 2018-12-16T14:13:50.799Z]            ~~^~~~~~~~~~~~~
[task 2018-12-16T14:13:53.512Z] /builds/worker/workspace/build/src/config/rules.mk:1131: recipe for target 'Unified_cpp_js_src2.o' failed
[task 2018-12-16T14:13:53.512Z] make[3]: *** [Unified_cpp_js_src2.o] Error 1
[task 2018-12-16T14:13:53.512Z] make[3]: *** Waiting for unfinished jobs....


:anba - could you please take a look at this?
Flags: needinfo?(andrebargull)
Attached patch bug1514587.patchSplinter Review
Forgot an explicit cast when comparing a scoped enum...
Assignee: nobody → andrebargull
Status: NEW → ASSIGNED
Flags: needinfo?(andrebargull)
Attachment #9031857 - Flags: review?(jorendorff)
Comment on attachment 9031857 [details] [diff] [review]
bug1514587.patch

Review of attachment 9031857 [details] [diff] [review]:
-----------------------------------------------------------------

Right, of course.

Maybe these nightly-as-beta builds ought to happen a bit more frequently...
Attachment #9031857 - Flags: review?(jorendorff) → review+
Keywords: checkin-needed
Pushed by ebalazs@mozilla.com:
https://hg.mozilla.org/integration/mozilla-inbound/rev/e86ac796f667
Add missing cast for typed enum comparison. r=jorendorff
Keywords: checkin-needed
https://hg.mozilla.org/mozilla-central/rev/e86ac796f667
Status: ASSIGNED → RESOLVED
Closed: 3 years ago
Resolution: --- → FIXED
Target Milestone: --- → mozilla66
You need to log in before you can comment on or make changes to this bug.