Closed Bug 1522824 Opened 2 years ago Closed 2 years ago

Permafailing Bustage on js/src/wasm/WasmCompile.cpp:92:27: error: 'class JS::ContextOptions' has no member named 'wasmGc'; did you mean 'wasm'? when Gecko 66 merges to Beta 2019-01-21

Categories

(Core :: Javascript: WebAssembly, defect)

defect
Not set
normal

Tracking

()

VERIFIED FIXED
mozilla66
Tracking Status
firefox-esr60 --- unaffected
firefox64 --- unaffected
firefox65 --- unaffected
firefox66 --- verified

People

(Reporter: nataliaCs, Assigned: bbouvier)

References

Details

[Tracking Requested - why for this release]:
Central as Beta: https://treeherder.mozilla.org/#/jobs?repo=try&revision=0262e2125ad98424d643c46915fd23158cdd303e

failure log: https://treeherder.mozilla.org/logviewer.html#/jobs?job_id=224015845&repo=try&lineNumber=5027

[task 2019-01-25T13:13:21.275Z] 13:13:21 INFO - make[4]: Leaving directory '/builds/worker/workspace/build/src/obj-firefox/modules/zlib/src'
[task 2019-01-25T13:13:21.644Z] 13:13:21 INFO - make[4]: Entering directory '/builds/worker/workspace/build/src/obj-firefox/js/src/wasm'
[task 2019-01-25T13:13:21.644Z] 13:13:21 INFO - /builds/worker/workspace/build/src/sccache2/sccache /builds/worker/workspace/build/src/clang/bin/clang++ -o Unified_cpp_js_src_wasm0.o -c -I/builds/worker/workspace/build/src/obj-firefox/dist/system_wrappers -include /builds/worker/workspace/build/src/config/gcc_hidden.h -DDEBUG=1 -DWASM_HUGE_MEMORY -DJS_CACHEIR_SPEW -DJS_STRUCTURED_SPEW -DJS_HAS_CTYPES -DFFI_BUILDING -DEXPORT_JS_API -DMOZ_HAS_MOZGLUE -I/builds/worker/workspace/build/src/js/src/wasm -I/builds/worker/workspace/build/src/obj-firefox/js/src/wasm -I/builds/worker/workspace/build/src/obj-firefox/js/src -I/builds/worker/workspace/build/src/js/src -I/builds/worker/workspace/build/src/obj-firefox/dist/include -I/builds/worker/workspace/build/src/obj-firefox/dist/include/nspr -fPIC -DMOZILLA_CLIENT -include /builds/worker/workspace/build/src/obj-firefox/js/src/js-confdefs.h -Qunused-arguments -U_FORTIFY_SOURCE -D_FORTIFY_SOURCE=2 -Qunused-arguments -Wall -Wbitfield-enum-conversion -Wempty-body -Wignored-qualifiers -Woverloaded-virtual -Wpointer-arith -Wshadow-field-in-constructor-modified -Wsign-compare -Wtype-limits -Wunreachable-code -Wunreachable-code-return -Wwrite-strings -Wno-invalid-offsetof -Wclass-varargs -Wfloat-overflow-conversion -Wfloat-zero-conversion -Wloop-analysis -Wc++1z-compat -Wc++2a-compat -Wcomma -Wimplicit-fallthrough -Werror=non-literal-null-conversion -Wstring-conversion -Wtautological-overlap-compare -Wtautological-unsigned-enum-zero-compare -Wtautological-unsigned-zero-compare -Wno-inline-new-delete -Wno-error=deprecated-declarations -Wno-error=array-bounds -Wno-error=return-std-move -Wno-error=atomic-alignment -Wformat -Wformat-security -Wno-gnu-zero-variadic-macro-arguments -Wno-noexcept-type -Wno-unknown-warning-option -Wno-return-type-c-linkage -D_GLIBCXX_USE_CXX11_ABI=0 -fno-sized-deallocation -fcrash-diagnostics-dir=/builds/worker/artifacts -U_FORTIFY_SOURCE -D_FORTIFY_SOURCE=2 -fno-rtti -ffunction-sections -fdata-sections -fno-exceptions -fno-math-errno -pthread -pipe -g -Xclang -load -Xclang /builds/worker/workspace/build/src/obj-firefox/build/clang-plugin/libclang-plugin.so -Xclang -add-plugin -Xclang moz-check -O3 -fno-omit-frame-pointer -funwind-tables -Werror -fno-strict-aliasing -Werror=format -Wno-shadow -MD -MP -MF .deps/Unified_cpp_js_src_wasm0.o.pp /builds/worker/workspace/build/src/obj-firefox/js/src/wasm/Unified_cpp_js_src_wasm0.cpp
[task 2019-01-25T13:13:21.644Z] 13:13:21 INFO - In file included from /builds/worker/workspace/build/src/obj-firefox/js/src/wasm/Unified_cpp_js_src_wasm0.cpp:38:
[task 2019-01-25T13:13:21.644Z] 13:13:21 ERROR - /builds/worker/workspace/build/src/js/src/wasm/WasmCompile.cpp:92:27: error: no member named 'wasmGc' in 'JS::ContextOptions'; did you mean 'wasm'?
[task 2019-01-25T13:13:21.644Z] 13:13:21 INFO - bool gc = cx->options().wasmGc();
[task 2019-01-25T13:13:21.644Z] 13:13:21 INFO - ^~~~~~
[task 2019-01-25T13:13:21.644Z] 13:13:21 INFO - wasm
[task 2019-01-25T13:13:21.644Z] 13:13:21 INFO - /builds/worker/workspace/build/src/obj-firefox/dist/include/js/ContextOptions.h:80:8: note: 'wasm' declared here
[task 2019-01-25T13:13:21.644Z] 13:13:21 INFO - bool wasm() const { return wasm_; }
[task 2019-01-25T13:13:21.644Z] 13:13:21 INFO - ^
[task 2019-01-25T13:13:21.644Z] 13:13:21 INFO - 1 error generated.
[task 2019-01-25T13:13:21.644Z] 13:13:21 INFO - /builds/worker/workspace/build/src/config/rules.mk:1106: recipe for target 'Unified_cpp_js_src_wasm0.o' failed
[task 2019-01-25T13:13:21.644Z] 13:13:21 ERROR - make[4]: *** [Unified_cpp_js_src_wasm0.o] Error 1
[task 2019-01-25T13:13:21.644Z] 13:13:21 INFO - make[4]: Leaving directory '/builds/worker/workspace/build/src/obj-firefox/js/src/wasm'
[task 2019-01-25T13:13:21.644Z] 13:13:21 INFO - /builds/worker/workspace/build/src/config/recurse.mk:74: recipe for target 'js/src/wasm/target' failed
[task 2019-01-25T13:13:21.644Z] 13:13:21 ERROR - make[3]: *** [js/src/wasm/target] Error 2
[task 2019-01-25T13:13:21.644Z] 13:13:21 INFO - make[3]: *** Waiting for unfinished jobs....

Flags: needinfo?(bbouvier)
Pushed by bbouvier@mozilla.com:
https://hg.mozilla.org/integration/mozilla-inbound/rev/90fb8bea5ef5
Add an ENABLE_WASM_REFTYPES around the use of wasmGc(); r=lth
Flags: needinfo?(bbouvier)
Summary: Permafailing Bustage on js/src/wasm/WasmCompile.cpp:92:27: error: 'class JS::ContextOptions' has no member named 'wasmGc'; did you mean 'wasm'? → Permafailing Bustage on js/src/wasm/WasmCompile.cpp:92:27: error: 'class JS::ContextOptions' has no member named 'wasmGc'; did you mean 'wasm'? when Gecko 66 merges to Beta 2019-01-21
Status: NEW → RESOLVED
Closed: 2 years ago
Resolution: --- → FIXED
Target Milestone: --- → mozilla66
Assignee: nobody → bbouvier
You need to log in before you can comment on or make changes to this bug.