Closed Bug 1524422 Opened 7 years ago Closed 7 years ago

Intermittent mozmake.EXE[4]: *** [InitializeDll.obj] Error 101120 after sh 4544 handle_exceptions: Exception: STATUS_ACCESS_VIOLATION

Categories

(Firefox Build System :: General, defect, P5)

defect

Tracking

(Not tracked)

RESOLVED INCOMPLETE

People

(Reporter: intermittent-bug-filer, Unassigned)

Details

(Keywords: intermittent-failure)

#[markdown(off)]
Filed by: csabou [at] mozilla.com

https://treeherder.mozilla.org/logviewer.html#?job_id=225326393&repo=mozilla-inbound

https://queue.taskcluster.net/v1/task/DKNuepcXTFeIMnNVvTQ2oQ/runs/0/artifacts/public/logs/live_backing.log

23:12:53 INFO - mozmake.EXE[4]: Leaving directory 'z:/build/build/src/obj-firefox/security/nss/cmd/modutil/modutil_modutil'
23:12:53 INFO - mozmake.EXE[4]: Entering directory 'z:/build/build/src/obj-firefox/gfx/angle/targets/translator'
23:12:53 INFO - gfx/angle/targets/translator/InitializeDll.obj
23:12:53 INFO - 0 [main] sh 4544 handle_exceptions: Exception: STATUS_ACCESS_VIOLATION
23:12:53 INFO - 3274 [main] sh 4544 open_stackdumpfile: Dumping stack trace to sh.exe.stackdump
23:12:53 INFO - z:/build/build/src/config/rules.mk:1101: recipe for target 'InitializeDll.obj' failed
23:12:53 INFO - mozmake.EXE[4]: *** [InitializeDll.obj] Error 101120
23:12:53 INFO - mozmake.EXE[4]: Leaving directory 'z:/build/build/src/obj-firefox/gfx/angle/targets/translator'
23:12:53 INFO - mozmake.EXE[4]: *** Waiting for unfinished jobs....
23:12:53 INFO - mozmake.EXE[4]: Entering directory 'z:/build/build/src/obj-firefox/browser/app'
23:12:53 INFO - z:/build/build/src/clang/bin/lld-link.exe -NOLOGO -OUT:../../dist/bin/firefox.exe -PDB:firefox.pdb -IMPLIB:firefox.lib -ENTRY:wmainCRTStartup -SUBSYSTEM:CONSOLE,6.01 -STACK:8388608 -LARGEADDRESSAWARE -RELEASE -DEBUG /HEAP:0x40000 -DELAYLOAD:oleaut32.dll -DELAYLOAD:ole32.dll -DELAYLOAD:winmm.dll -DELAYLOAD:user32.dll @z:/build/build/src/obj-firefox/browser/app/firefox_exe.list ./module.res ..\..\mozglue\build\mozglue.lib kernel32.lib user32.lib gdi32.lib winmm.lib wsock32.lib advapi32.lib secur32.lib ntdll.lib oleaut32.lib ole32.lib delayimp.lib
23:12:53 INFO - lld-link: warning: ignoring unknown argument: -RELEASE

Summary: Intermittent mozmake.EXE[4]: *** [InitializeDll.obj] Error 101120 → Intermittent mozmake.EXE[4]: *** [InitializeDll.obj] Error 101120 after sh 4544 handle_exceptions: Exception: STATUS_ACCESS_VIOLATION
Status: NEW → RESOLVED
Closed: 7 years ago
Resolution: --- → INCOMPLETE
You need to log in before you can comment on or make changes to this bug.