Open Bug 1532404 Opened 8 months ago Updated 4 months ago

Intermittent org.mozilla.geckoview.test.MediaElementTest.webmPlayMediaFromScript | status -2

Categories

(GeckoView :: General, defect, P3)

Unspecified
Android
defect

Tracking

(firefox-esr60 unaffected, firefox67 unaffected, firefox68 disabled, firefox69 disabled)

REOPENED
Tracking Status
firefox-esr60 --- unaffected
firefox67 --- unaffected
firefox68 --- disabled
firefox69 --- disabled

People

(Reporter: intermittent-bug-filer, Unassigned)

References

(Blocks 1 open bug)

Details

(Keywords: intermittent-failure, leave-open, regression, Whiteboard: [stockwell disabled])

Attachments

(1 file)

#[markdown(off)]
Filed by: apavel [at] mozilla.com

https://treeherder.mozilla.org/logviewer.html#?job_id=231710782&repo=autoland

https://queue.taskcluster.net/v1/task/KVITtEgkS1OgV1I6s1QZtQ/runs/0/artifacts/public/logs/live_backing.log

[task 2019-03-04T19:53:19.535Z] 19:53:19 INFO - TEST-START | org.mozilla.geckoview.test.MediaElementTest.webmPlayMediaFromScript
[task 2019-03-04T19:53:29.562Z] 19:53:29 INFO - org.mozilla.geckoview.test | INSTRUMENTATION_STATUS: id=AndroidJUnitRunner
[task 2019-03-04T19:53:29.562Z] 19:53:29 INFO - org.mozilla.geckoview.test | INSTRUMENTATION_STATUS: current=77
[task 2019-03-04T19:53:29.562Z] 19:53:29 INFO - org.mozilla.geckoview.test | INSTRUMENTATION_STATUS: class=org.mozilla.geckoview.test.MediaElementTest
[task 2019-03-04T19:53:29.562Z] 19:53:29 INFO - org.mozilla.geckoview.test | INSTRUMENTATION_STATUS: stream=
[task 2019-03-04T19:53:29.562Z] 19:53:29 INFO - org.mozilla.geckoview.test | Error in webmPlayMediaFromScript(org.mozilla.geckoview.test.MediaElementTest):
[task 2019-03-04T19:53:29.562Z] 19:53:29 INFO - org.mozilla.geckoview.test | java.lang.AssertionError: Cannot find Promise
[task 2019-03-04T19:53:29.562Z] 19:53:29 INFO - org.mozilla.geckoview.test | at org.mozilla.geckoview.test.rule.GeckoSessionTestRule.evaluateJS(GeckoSessionTestRule.java:2070)
[task 2019-03-04T19:53:29.562Z] 19:53:29 INFO - org.mozilla.geckoview.test | at org.mozilla.geckoview.test.rule.GeckoSessionTestRule.evaluateJS(GeckoSessionTestRule.java:2022)
[task 2019-03-04T19:53:29.562Z] 19:53:29 INFO - org.mozilla.geckoview.test | at org.mozilla.geckoview.test.MediaElementTest.playMediaFromScript(MediaElementTest.kt:136)
[task 2019-03-04T19:53:29.562Z] 19:53:29 INFO - org.mozilla.geckoview.test | at org.mozilla.geckoview.test.MediaElementTest.webmPlayMediaFromScript(MediaElementTest.kt:276)
[task 2019-03-04T19:53:29.562Z] 19:53:29 INFO - org.mozilla.geckoview.test | at java.lang.reflect.Method.invokeNative(Native Method)
[task 2019-03-04T19:53:29.562Z] 19:53:29 INFO - org.mozilla.geckoview.test | at java.lang.reflect.Method.invoke(Method.java:525)
[task 2019-03-04T19:53:29.562Z] 19:53:29 INFO - org.mozilla.geckoview.test | at org.junit.runners.model.FrameworkMethod$1.runReflectiveCall(FrameworkMethod.java:50)
[task 2019-03-04T19:53:29.562Z] 19:53:29 INFO - org.mozilla.geckoview.test | at org.junit.internal.runners.model.ReflectiveCallable.run(ReflectiveCallable.java:12)
[task 2019-03-04T19:53:29.562Z] 19:53:29 INFO - org.mozilla.geckoview.test | at org.junit.runners.model.FrameworkMethod.invokeExplosively(FrameworkMethod.java:47)
[task 2019-03-04T19:53:29.562Z] 19:53:29 INFO - org.mozilla.geckoview.test | at org.junit.internal.runners.statements.InvokeMethod.evaluate(InvokeMethod.java:17)
[task 2019-03-04T19:53:29.562Z] 19:53:29 INFO - org.mozilla.geckoview.test | at org.mozilla.geckoview.test.rule.GeckoSessionTestRule$3$1.run(GeckoSessionTestRule.java:1422)
[task 2019-03-04T19:53:29.562Z] 19:53:29 INFO - org.mozilla.geckoview.test | at android.app.Instrumentation$SyncRunnable.run(Instrumentation.java:1719)
[task 2019-03-04T19:53:29.562Z] 19:53:29 INFO - org.mozilla.geckoview.test | at android.os.Handler.handleCallback(Handler.java:730)
[task 2019-03-04T19:53:29.562Z] 19:53:29 INFO - org.mozilla.geckoview.test | at android.os.Handler.dispatchMessage(Handler.java:92)
[task 2019-03-04T19:53:29.562Z] 19:53:29 INFO - org.mozilla.geckoview.test | at android.os.Looper.loop(Looper.java:137)
[task 2019-03-04T19:53:29.562Z] 19:53:29 INFO - org.mozilla.geckoview.test | at android.app.ActivityThread.main(ActivityThread.java:5103)
[task 2019-03-04T19:53:29.562Z] 19:53:29 INFO - org.mozilla.geckoview.test | at java.lang.reflect.Method.invokeNative(Native Method)
[task 2019-03-04T19:53:29.562Z] 19:53:29 INFO - org.mozilla.geckoview.test | at java.lang.reflect.Method.invoke(Method.java:525)
[task 2019-03-04T19:53:29.562Z] 19:53:29 INFO - org.mozilla.geckoview.test | at com.android.internal.os.ZygoteInit$MethodAndArgsCaller.run(ZygoteInit.java:737)
[task 2019-03-04T19:53:29.562Z] 19:53:29 INFO - org.mozilla.geckoview.test | at com.android.internal.os.ZygoteInit.main(ZygoteInit.java:553)
[task 2019-03-04T19:53:29.562Z] 19:53:29 INFO - org.mozilla.geckoview.test | at dalvik.system.NativeStart.main(Native Method)
[task 2019-03-04T19:53:29.562Z] 19:53:29 INFO - org.mozilla.geckoview.test |
[task 2019-03-04T19:53:29.562Z] 19:53:29 INFO - org.mozilla.geckoview.test | INSTRUMENTATION_STATUS: numtests=140
[task 2019-03-04T19:53:29.562Z] 19:53:29 INFO - org.mozilla.geckoview.test | INSTRUMENTATION_STATUS: stack=java.lang.AssertionError: Cannot find Promise
[task 2019-03-04T19:53:29.562Z] 19:53:29 INFO - org.mozilla.geckoview.test | at org.mozilla.geckoview.test.rule.GeckoSessionTestRule.evaluateJS(GeckoSessionTestRule.java:2070)
[task 2019-03-04T19:53:29.562Z] 19:53:29 INFO - org.mozilla.geckoview.test | at org.mozilla.geckoview.test.rule.GeckoSessionTestRule.evaluateJS(GeckoSessionTestRule.java:2022)
[task 2019-03-04T19:53:29.562Z] 19:53:29 INFO - org.mozilla.geckoview.test | at org.mozilla.geckoview.test.MediaElementTest.playMediaFromScript(MediaElementTest.kt:136)
[task 2019-03-04T19:53:29.562Z] 19:53:29 INFO - org.mozilla.geckoview.test | at org.mozilla.geckoview.test.MediaElementTest.webmPlayMediaFromScript(MediaElementTest.kt:276)
[task 2019-03-04T19:53:29.562Z] 19:53:29 INFO - org.mozilla.geckoview.test | at java.lang.reflect.Method.invokeNative(Native Method)
[task 2019-03-04T19:53:29.562Z] 19:53:29 INFO - org.mozilla.geckoview.test | at java.lang.reflect.Method.invoke(Method.java:525)
[task 2019-03-04T19:53:29.562Z] 19:53:29 INFO - org.mozilla.geckoview.test | at org.junit.runners.model.FrameworkMethod$1.runReflectiveCall(FrameworkMethod.java:50)
[task 2019-03-04T19:53:29.562Z] 19:53:29 INFO - org.mozilla.geckoview.test | at org.junit.internal.runners.model.ReflectiveCallable.run(ReflectiveCallable.java:12)
[task 2019-03-04T19:53:29.562Z] 19:53:29 INFO - org.mozilla.geckoview.test | at org.junit.runners.model.FrameworkMethod.invokeExplosively(FrameworkMethod.java:47)
[task 2019-03-04T19:53:29.563Z] 19:53:29 INFO - org.mozilla.geckoview.test | at org.junit.internal.runners.statements.InvokeMethod.evaluate(InvokeMethod.java:17)
[task 2019-03-04T19:53:29.563Z] 19:53:29 INFO - org.mozilla.geckoview.test | at org.mozilla.geckoview.test.rule.GeckoSessionTestRule$3$1.run(GeckoSessionTestRule.java:1422)
[task 2019-03-04T19:53:29.563Z] 19:53:29 INFO - org.mozilla.geckoview.test | at android.app.Instrumentation$SyncRunnable.run(Instrumentation.java:1719)
[task 2019-03-04T19:53:29.563Z] 19:53:29 INFO - org.mozilla.geckoview.test | at android.os.Handler.handleCallback(Handler.java:730)
[task 2019-03-04T19:53:29.564Z] 19:53:29 INFO - org.mozilla.geckoview.test | at android.os.Handler.dispatchMessage(Handler.java:92)
[task 2019-03-04T19:53:29.564Z] 19:53:29 INFO - org.mozilla.geckoview.test | at android.os.Looper.loop(Looper.java:137)
[task 2019-03-04T19:53:29.564Z] 19:53:29 INFO - org.mozilla.geckoview.test | at android.app.ActivityThread.main(ActivityThread.java:5103)
[task 2019-03-04T19:53:29.565Z] 19:53:29 INFO - org.mozilla.geckoview.test | at java.lang.reflect.Method.invokeNative(Native Method)
[task 2019-03-04T19:53:29.565Z] 19:53:29 INFO - org.mozilla.geckoview.test | at java.lang.reflect.Method.invoke(Method.java:525)
[task 2019-03-04T19:53:29.566Z] 19:53:29 INFO - org.mozilla.geckoview.test | at com.android.internal.os.ZygoteInit$MethodAndArgsCaller.run(ZygoteInit.java:737)
[task 2019-03-04T19:53:29.566Z] 19:53:29 INFO - org.mozilla.geckoview.test | at com.android.internal.os.ZygoteInit.main(ZygoteInit.java:553)
[task 2019-03-04T19:53:29.566Z] 19:53:29 INFO - org.mozilla.geckoview.test | at dalvik.system.NativeStart.main(Native Method)
[task 2019-03-04T19:53:29.567Z] 19:53:29 INFO - org.mozilla.geckoview.test |
[task 2019-03-04T19:53:29.567Z] 19:53:29 INFO - org.mozilla.geckoview.test | INSTRUMENTATION_STATUS: test=webmPlayMediaFromScript
[task 2019-03-04T19:53:29.567Z] 19:53:29 INFO - org.mozilla.geckoview.test | INSTRUMENTATION_STATUS_CODE: -2
[task 2019-03-04T19:53:29.567Z] 19:53:29 WARNING - TEST-UNEXPECTED-FAIL | org.mozilla.geckoview.test.MediaElementTest.webmPlayMediaFromScript | status -2
[task 2019-03-04T19:53:29.567Z] 19:53:29 INFO - TEST-INFO took 10031ms
[task 2019-03-04T19:53:29.568Z] 19:53:29 INFO - org.mozilla.geckoview.test | INSTRUMENTATION_STATUS: id=AndroidJUnitRunner
[task 2019-03-04T19:53:29.569Z] 19:53:29 INFO - org.mozilla.geckoview.test | INSTRUMENTATION_STATUS: current=78
[task 2019-03-04T19:53:29.569Z] 19:53:29 INFO - org.mozilla.geckoview.test | INSTRUMENTATION_STATUS: class=org.mozilla.geckoview.test.MediaElementTest
[task 2019-03-04T19:53:29.570Z] 19:53:29 INFO - org.mozilla.geckoview.test | INSTRUMENTATION_STATUS: stream=
[task 2019-03-04T19:53:29.570Z] 19:53:29 INFO - org.mozilla.geckoview.test | INSTRUMENTATION_STATUS: numtests=140
[task 2019-03-04T19:53:29.570Z] 19:53:29 INFO - org.mozilla.geckoview.test | INSTRUMENTATION_STATUS: test=mp4FullscreenMedia
[task 2019-03-04T19:53:29.571Z] 19:53:29 INFO - org.mozilla.geckoview.test | INSTRUMENTATION_STATUS_CODE: 1

OS: All → Android
Priority: P5 → P3

This bug is on disabled recommended list. 105 failures are associated with this bug in the last 7 days.

Platform breakdown:
android-em-4-3-armv7-api16: 22

:cpeterson, can you please assign someone to take a look at this?

Whiteboard: [stockwell disable-recommended] → [stockwell needswork:owner]

There are 11 or more tests failing here.

First failure:
04-29 03:16:54.584 797 810 I TestRunner: started: webmPlayMedia(org.mozilla.geckoview.test.MediaElementTest)
04-29 03:16:54.614 797 797 I MonitoringInstr: Activities that are still in CREATED to STOPPED: 0
04-29 03:16:54.654 797 815 D GeckoViewXUL: onEvent GeckoView:UpdateModuleState {"enabled":true,"module":"GeckoViewNavigation"}
04-29 03:16:54.664 797 815 D GeckoViewXUL: onEvent GeckoView:UpdateModuleState {"enabled":true,"module":"GeckoViewContentBlocking"}
04-29 03:16:54.674 797 815 D GeckoViewXUL: onEvent GeckoView:UpdateModuleState {"enabled":true,"module":"GeckoViewPermission"}
04-29 03:16:54.684 797 815 D GeckoViewXUL: onEvent GeckoView:UpdateModuleState {"enabled":true,"module":"GeckoViewHistory"}
04-29 03:16:54.704 797 815 D GeckoViewXUL: onEvent GeckoView:UpdateModuleState {"enabled":true,"module":"GeckoViewMedia"}
04-29 03:16:54.704 797 815 D GeckoViewXUL: onEvent GeckoView:UpdateModuleState {"enabled":true,"module":"GeckoViewScroll"}
04-29 03:16:54.714 1024 1037 I Gecko : console.error: "Error sending event: promises-settled"
04-29 03:16:54.714 797 815 D GeckoViewXUL: onEvent GeckoView:UpdateModuleState {"enabled":true,"module":"GeckoViewContent"}
04-29 03:16:54.724 797 815 D GeckoViewXUL: onEvent GeckoView:UpdateModuleState {"enabled":true,"module":"GeckoViewSelectionAction"}
04-29 03:16:54.734 797 815 D GeckoViewXUL: onEvent GeckoView:UpdateModuleState {"enabled":true,"module":"GeckoViewProgress"}
04-29 03:16:54.744 797 815 D GeckoViewModule: dispatch GeckoView:LoadUri, data={"uri":"about:blank","flags":0}
04-29 03:16:54.764 1024 1037 E Web Content: [JavaScript Error: "Error sending event: promises-settled"]
04-29 03:16:54.774 797 815 D GeckoViewNavigation: onEvent: event=GeckoView:LoadUri, data={"uri":"about:blank","flags":0}
04-29 03:16:54.784 1024 1037 I Gecko : console.error: "TypeError: this._navigationLifetimePool is null: _createObjectActorForPromise@resource://devtools/server/actors/promises.js:116:9\nobjectGrip@resource://devtools/server/actors/promises.js:147:17\ncreateValueGrip@resource://devtools/server/actors/object/utils.js:122:14\ncreateValueGrip@resource://devtools/server/actors/promises.js:125:9\n_createPromiseState@resource://devtools/server/actors/object.js:188:40\nform@resource://devtools/server/actors/object.js:131:29\nwrite@resource://devtools/shared/specs/promises.js:15:25\ntypes.addArrayType/write/<@resource://devtools/shared/protocol.js:231:33\nwrite@resource://devtools/shared/protocol.js:231:16\nwrite@resource://devtools/shared/protocol.js:511:22\nwrite@resource://devtools/shared/protocol.js:693:26\n_sendEvent@resource://devtools/shared/protocol.js:1017:24\ninitialize/<@resource://devtools/shared/protocol.js:999:16\nemit@resource://devtools/shared/event-emitter.js:186:24\nemit@resource://devtools/shared/event-emitter.js:267:18\n_makePromiseEve
04-29 03:16:54.784 1024 1037 E Web Content: [JavaScript Error: "TypeError: this._navigationLifetimePool is null: _createObjectActorForPromise@resource://devtools/server/actors/promises.js:116:9
04-29 03:16:54.784 1024 1037 E Web Content: objectGrip@resource://devtools/server/actors/promises.js:147:17
04-29 03:16:54.784 1024 1037 E Web Content: createValueGrip@resource://devtools/server/actors/object/utils.js:122:14
04-29 03:16:54.784 1024 1037 E Web Content: createValueGrip@resource://devtools/server/actors/promises.js:125:9
04-29 03:16:54.784 1024 1037 E Web Content: _createPromiseState@resource://devtools/server/actors/object.js:188:40
04-29 03:16:54.784 1024 1037 E Web Content: form@resource://devtools/server/actors/object.js:131:29
04-29 03:16:54.784 1024 1037 E Web Content: write@resource://devtools/shared/specs/promises.js:15:25
04-29 03:16:54.784 1024 1037 E Web Content: types.addArrayType/write/<@resource://devtools/shared/protocol.js:231:33
04-29 03:16:54.784 1024 1037 E Web Content: write@resource://devtools/shared/protocol.js:231:16
04-29 03:16:54.784 1024 1037 E Web Content: write@resource://devtools/shared/protocol.js:511:22
04-29 03:16:54.784 1024 1037 E Web Content: write@resource://devtools/shared/protocol.js:693:26
04-29 03:16:54.784 1024 1037 E Web Content: _sendEvent@resource://devtools/shared/protocol.js:1017:24
04-29 03:16:54.784 1024 1037 E Web Content: initialize/<@resource://devtools/shared/protocol.js:999:16
04-29 03:16:54.784 1024 1037 E Web Content: emit@resource://devtools/shared/event-emitter.js:186:24
04-29 03:16:54.784 1024 1037 E Web Content: emit@resource://devtools/shared/event-emitter.js:267:18
04-29 03:16:54.784 1024 1037 E Web Content: _makePromiseEventHandler/<

The next failure also mentions Promise:
04-29 03:21:35.954 1024 1037 D GeckoViewProgress[C]: ProgressTracker updateProgress data={"prev":55,"uri":"resource://android/assets/www/scroll.html","locationChange":true,"pageStart":true,"pageStop":false,"firstPaint":false,"pageShow":true,"parsed":true} progress=100
04-29 03:21:36.074 1024 1037 D GeckoViewProgress[C]: onStateChange: isTopLevel=true, flags=0xc0010, status=NS_OK
04-29 03:21:36.084 1024 1037 D GeckoViewProgress[C]: onStateChange: uri=jar:file:///data/app/org.mozilla.geckoview.test-1.apk!/assets/www/scroll.html
04-29 03:21:36.084 1024 1037 D GeckoViewProgress[C]: ProgressTracker stop
04-29 03:21:36.084 1024 1037 D GeckoViewProgress[C]: ProgressTracker updateProgress
04-29 03:21:36.214 797 815 D GeckoViewProgress: onStateChange: isTopLevel=true, flags=0xc0010, status=NS_OK loadType=1
04-29 03:21:36.244 797 815 D GeckoViewProgress: onStateChange: uri=jar:file:///data/app/org.mozilla.geckoview.test-1.apk!/assets/www/scroll.html isSuccess=true isStart=false isStop=true
04-29 03:21:37.094 797 815 D GeckoViewModule: dispatch GeckoView:ScrollBy, data={"widthValue":1,"heightValue":0,"widthType":1,"heightType":0,"behavior":1}
04-29 03:21:37.124 797 815 D GeckoViewContent: onEvent: event=GeckoView:ScrollBy, data={"widthValue":1,"heightValue":0,"widthType":1,"heightType":0,"behavior":1}
04-29 03:21:37.204 1024 1037 D GeckoViewContent[C]: receiveMessage: GeckoView:ScrollBy
04-29 03:21:37.674 1024 1037 D GeckoViewScroll[C]: handleEvent: mozvisualscroll
04-29 03:21:39.514 797 810 I TestRunner: failed: scrollByHorizontalAuto(org.mozilla.geckoview.test.PanZoomControllerTest)
04-29 03:21:39.514 797 810 I TestRunner: ----- begin exception -----
04-29 03:21:39.534 797 810 I TestRunner: java.lang.AssertionError: Cannot find Promise
04-29 03:21:39.534 797 810 I TestRunner: at org.mozilla.geckoview.test.rule.GeckoSessionTestRule.evaluateJS(GeckoSessionTestRule.java:2070)
04-29 03:21:39.534 797 810 I TestRunner: at org.mozilla.geckoview.test.rule.GeckoSessionTestRule.evaluateJS(GeckoSessionTestRule.java:2022)
04-29 03:21:39.534 797 810 I TestRunner: at org.mozilla.geckoview.test.PanZoomControllerTest.waitForScroll(PanZoomControllerTest.kt:27)
04-29 03:21:39.534 797 810 I TestRunner: at org.mozilla.geckoview.test.PanZoomControllerTest.waitForHorizontalScroll(PanZoomControllerTest.kt:45)
04-29 03:21:39.534 797 810 I TestRunner: at org.mozilla.geckoview.test.PanZoomControllerTest.scrollByHorizontal(PanZoomControllerTest.kt:69)
04-29 03:21:39.534 797 810 I TestRunner: at org.mozilla.geckoview.test.PanZoomControllerTest.scrollByHorizontalAuto(PanZoomControllerTest.kt:85)
04-29 03:21:39.534 797 810 I TestRunner: at java.lang.reflect.Method.invokeNative(Native Method)
04-29 03:21:39.534 797 810 I TestRunner: at java.lang.reflect.Method.invoke(Method.java:525)
04-29 03:21:39.534 797 810 I TestRunner: at org.junit.runners.model.FrameworkMethod$1.runReflectiveCall(FrameworkMethod.java:50)
04-29 03:21:39.534 797 810 I TestRunner: at org.junit.internal.runners.model.ReflectiveCallable.run(ReflectiveCallable.java:12)
04-29 03:21:39.534 797 810 I TestRunner: at org.junit.runners.model.FrameworkMethod.invokeExplosively(FrameworkMethod.java:47)
04-29 03:21:39.534 797 810 I TestRunner: at org.junit.internal.runners.statements.InvokeMethod.evaluate(InvokeMethod.java:17)
04-29 03:21:39.534 797 810 I TestRunner: at org.mozilla.geckoview.test.rule.GeckoSessionTestRule$3$1.run(GeckoSessionTestRule.java:1422)
04-29 03:21:39.534 797 810 I TestRunner: at android.app.Instrumentation$SyncRunnable.run(Instrumentation.java:1719)
04-29 03:21:39.534 797 810 I TestRunner: at android.os.Handler.handleCallback(Handler.java:730)
04-29 03:21:39.534 797 810 I TestRunner: at android.os.Handler.dispatchMessage(Handler.java:92)
04-29 03:21:39.534 797 810 I TestRunner: at android.os.Looper.loop(Looper.java:137)
04-29 03:21:39.534 797 810 I TestRunner: at android.app.ActivityThread.main(ActivityThread.java:5103)
04-29 03:21:39.534 797 810 I TestRunner: at java.lang.reflect.Method.invokeNative(Native Method)
04-29 03:21:39.534 797 810 I TestRunner: at java.lang.reflect.Method.invoke(Method.java:525)
04-29 03:21:39.534 797 810 I TestRunner: at com.android.internal.os.ZygoteInit$MethodAndArgsCaller.run(ZygoteInit.java:737)
04-29 03:21:39.534 797 810 I TestRunner: at com.android.internal.os.ZygoteInit.main(ZygoteInit.java:553)
04-29 03:21:39.534 797 810 I TestRunner: at dalvik.system.NativeStart.main(Native Method)
04-29 03:21:39.544 797 810 I TestRunner: ----- end exception -----

Do you have an idea about the pattern of failing tests as described in comment 16?

Flags: needinfo?(gbrown)

(In reply to Sebastian Hengst [:aryx] (needinfo on intermittent or backout) from comment #18)

Do you have an idea about the pattern of failing tests as described in comment 16?

Sorry, no idea. Last I heard, :agi is working on resolving geckoview-junit failures (but he is pto). What happens if the first test is skipped?

Flags: needinfo?(gbrown) → needinfo?(cpeterson)

Feel free to temporarily disable this test. Agi will look at these junit test failures when he returns from PTO in two weeks.

Flags: needinfo?(cpeterson)
Whiteboard: [stockwell disable-recommended]
Attachment #9068615 - Attachment description: Bug 1532404 - Disable org.mozilla.geckoview.test.MediaElementTest.webmPlayMediaFromScript on pgo and debug for frequent failures → Bug 1532404 - Disable org.mozilla.geckoview.test.MediaElementTest.webmPlayMediaFromScript on pgo and debug for frequent failures. r=Aryx
Whiteboard: [stockwell disable-recommended] → [stockwell disabled]
Pushed by ncsoregi@mozilla.com:
https://hg.mozilla.org/integration/autoland/rev/571736037be3
Disable org.mozilla.geckoview.test.MediaElementTest.webmPlayMediaFromScript on pgo and debug for frequent failures. r=jmaher
Status: NEW → RESOLVED
Closed: 4 months ago
Resolution: --- → FIXED
Target Milestone: --- → mozilla69
Whiteboard: [stockwell disabled] → [stockwell disabled][checkin-needed-beta]
Status: RESOLVED → REOPENED
Keywords: leave-open
Resolution: FIXED → ---
Target Milestone: mozilla69 → ---
Whiteboard: [stockwell disabled][checkin-needed-beta] → [stockwell disabled]
You need to log in before you can comment on or make changes to this bug.