Intermittent testing/marionette/harness/marionette_harness/tests/unit/test_execute_isolate.py TestExecuteIsolationChrome.test_execute_async_isolate | ScriptTimeoutException: Timed out after 6000 ms
Categories
(Testing :: Marionette Client and Harness, defect, P5)
Tracking
(Not tracked)
People
(Reporter: intermittent-bug-filer, Unassigned)
Details
(Keywords: intermittent-failure, regression)
#[markdown(off)]
Filed by: btara [at] mozilla.com
https://treeherder.mozilla.org/logviewer.html#?job_id=233184800&repo=mozilla-release
[task 2019-03-11T19:38:15.412Z] 19:38:15 INFO - TEST-START | testing/marionette/harness/marionette_harness/tests/unit/test_window_status_chrome.py TestNoSuchWindowContent.test_closed_tab_while_in_frame
[task 2019-03-11T19:38:41.281Z] 19:38:41 INFO - TEST-PASS | testing/marionette/harness/marionette_harness/tests/unit/test_window_status_chrome.py TestNoSuchWindowContent.test_closed_tab_while_in_frame | took 25870ms
[task 2019-03-11T19:38:41.700Z] 19:38:41 INFO - TEST-START | testing/marionette/harness/marionette_harness/tests/unit/test_execute_isolate.py TestExecuteIsolationChrome.test_execute_async_isolate
[task 2019-03-11T19:38:54.600Z] 19:38:54 WARNING - TEST-UNEXPECTED-ERROR | testing/marionette/harness/marionette_harness/tests/unit/test_execute_isolate.py TestExecuteIsolationChrome.test_execute_async_isolate | ScriptTimeoutException: Timed out after 6000 ms
[task 2019-03-11T19:38:54.601Z] 19:38:54 INFO - stacktrace:
[task 2019-03-11T19:38:54.601Z] 19:38:54 INFO - WebDriverError@chrome://marionette/content/error.js:179:5
[task 2019-03-11T19:38:54.602Z] 19:38:54 INFO - ScriptTimeoutError@chrome://marionette/content/error.js:419:5
[task 2019-03-11T19:38:54.602Z] 19:38:54 INFO - evaluate.sandbox/promise</scriptTimeoutID<@chrome://marionette/content/evaluate.js:123:49
[task 2019-03-11T19:38:54.603Z] 19:38:54 INFO - notify@resource://gre/modules/Timer.jsm:42:7
[task 2019-03-11T19:38:54.603Z] 19:38:54 INFO - Traceback (most recent call last):
[task 2019-03-11T19:38:54.604Z] 19:38:54 INFO - File "/builds/worker/workspace/build/venv/lib/python2.7/site-packages/marionette_harness/marionette_test/testcases.py", line 159, in run
[task 2019-03-11T19:38:54.604Z] 19:38:54 INFO - testMethod()
[task 2019-03-11T19:38:54.605Z] 19:38:54 INFO - File "/builds/worker/workspace/build/tests/marionette/tests/testing/marionette/harness/marionette_harness/tests/unit/test_execute_isolate.py", line 31, in test_execute_async_isolate
[task 2019-03-11T19:38:54.605Z] 19:38:54 INFO - """.format(multiplier))
[task 2019-03-11T19:38:54.605Z] 19:38:54 INFO - File "/builds/worker/workspace/build/venv/lib/python2.7/site-packages/marionette_driver/marionette.py", line 1827, in execute_async_script
[task 2019-03-11T19:38:54.606Z] 19:38:54 INFO - rv = self._send_message("WebDriver:ExecuteAsyncScript", body, key="value")
[task 2019-03-11T19:38:54.607Z] 19:38:54 INFO - File "/builds/worker/workspace/build/venv/lib/python2.7/site-packages/marionette_driver/decorators.py", line 26, in _
[task 2019-03-11T19:38:54.608Z] 19:38:54 INFO - return func(*args, **kwargs)
[task 2019-03-11T19:38:54.609Z] 19:38:54 INFO - File "/builds/worker/workspace/build/venv/lib/python2.7/site-packages/marionette_driver/marionette.py", line 769, in _send_message
[task 2019-03-11T19:38:54.609Z] 19:38:54 INFO - self._handle_error(err)
[task 2019-03-11T19:38:54.610Z] 19:38:54 INFO - File "/builds/worker/workspace/build/venv/lib/python2.7/site-packages/marionette_driver/marionette.py", line 789, in _handle_error
[task 2019-03-11T19:38:54.611Z] 19:38:54 INFO - raise errors.lookup(error)(message, stacktrace=stacktrace)
[task 2019-03-11T19:38:54.611Z] 19:38:54 INFO - TEST-INFO took 12900ms
[task 2019-03-11T19:38:55.063Z] 19:38:55 INFO - TEST-START | testing/marionette/harness/marionette_harness/tests/unit/test_execute_isolate.py TestExecuteIsolationContent.test_execute_async_isolate
[task 2019-03-11T19:39:04.166Z] 19:39:04 INFO - TEST-PASS | testing/marionette/harness/marionette_harness/tests/unit/test_execute_isolate.py TestExecuteIsolationContent.test_execute_async_isolate | took 9103ms
[task 2019-03-11T19:39:04.683Z] 19:39:04 INFO - SUMMARY
[task 2019-03-11T19:39:04.683Z] 19:39:04 INFO - -------
[task 2019-03-11T19:39:04.683Z] 19:39:04 INFO - passed: 88
[task 2019-03-11T19:39:04.683Z] 19:39:04 WARNING - failed: 1
[task 2019-03-11T19:39:04.683Z] 19:39:04 WARNING - One or more unittests failed.
[task 2019-03-11T19:39:04.684Z] 19:39:04 INFO - todo: 43 (skipped: 7)
[task 2019-03-11T19:39:04.685Z] 19:39:04 INFO - FAILED TESTS
[task 2019-03-11T19:39:04.685Z] 19:39:04 INFO - -------
[task 2019-03-11T19:39:04.685Z] 19:39:04 INFO - test_execute_isolate.py test_execute_isolate.TestExecuteIsolationChrome.test_execute_async_isolate
[task 2019-03-11T19:39:04.892Z] 19:39:04 INFO - SUITE-END | took 1112s
[task 2019-03-11T19:39:10.988Z] 19:39:10 ERROR - Return code: 10
[task 2019-03-11T19:39:10.989Z] 19:39:10 INFO - TinderboxPrint: marionette<br/>88/<em class="testfail">1</em>/43
[task 2019-03-11T19:39:10.989Z] 19:39:10 INFO - ##### marionette log ends
[task 2019-03-11T19:39:10.990Z] 19:39:10 WARNING - # TBPL WARNING #
[task 2019-03-11T19:39:10.990Z] 19:39:10 WARNING - setting return code to 1
[task 2019-03-11T19:39:10.990Z] 19:39:10 WARNING - The marionette suite: marionette ran with return status: WARNING
Updated•6 years ago
|
Comment hidden (Intermittent Failures Robot) |
Updated•2 years ago
|
Comment 3•2 years ago
|
||
Description
•