Closed Bug 1553116 Opened 6 months ago Closed 6 months ago

Windows AArch64 L10n build bustages: mozbuild.configure.options.InvalidOptionError: --enable-hardening is not available in this configuration

Categories

(Firefox Build System :: Task Configuration, defect)

defect
Not set

Tracking

(firefox69 fixed)

RESOLVED FIXED
mozilla69
Tracking Status
firefox69 --- fixed

People

(Reporter: rmaries, Assigned: dmajor)

References

(Regression)

Details

Attachments

(1 file)

Push with failure: https://treeherder.mozilla.org/#/jobs?repo=mozilla-central&resultStatus=testfailed%2Cbusted%2Cexception&classifiedState=unclassified&revision=b74e5737da64a7af28ab4f81f996950917aa71c5&searchStr=windows%2C2012&selectedJob=247526233

Failure log: https://treeherder.mozilla.org/logviewer.html#/jobs?job_id=247526233&repo=mozilla-central&lineNumber=902

12:02:10 INFO - 0:06.13 checking for vcs source checkout... hg
12:02:10 INFO - 0:06.41 checking for a shell... C:/mozilla-build/msys/bin/sh.exe
12:02:10 INFO - 0:06.41 checking for host system type... x86_64-pc-mingw32
12:02:10 INFO - 0:06.47 checking for target system type... aarch64-windows-mingw32
12:02:11 INFO - 0:06.59 checking whether cross compiling... yes
12:02:11 INFO - 0:06.67 Traceback (most recent call last):
12:02:11 INFO - 0:06.67 File "z:/task_1558437585/build/src/configure.py", line 132, in <module>
12:02:11 INFO - 0:06.67 sys.exit(main(sys.argv))
12:02:11 INFO - 0:06.67 File "z:/task_1558437585/build/src/configure.py", line 38, in main
12:02:11 INFO - 0:06.67 sandbox.run(os.path.join(os.path.dirname(file), 'moz.configure'))
12:02:11 INFO - 0:06.67 File "z:\task_1558437585\build\src\python\mozbuild\mozbuild\configure_init_.py", line 441, in run
12:02:11 INFO - 0:06.67 self.value_for(option)
12:02:11 INFO - 0:06.67 File "z:\task_1558437585\build\src\python\mozbuild\mozbuild\configure_init
.py", line 528, in _value_for
12:02:11 INFO - 0:06.67 return self.value_for_option(obj)
12:02:11 INFO - 0:06.67 File "z:\task_1558437585\build\src\python\mozbuild\mozbuild\util.py", line 947, in method_call
12:02:11 INFO - 0:06.67 cache[args] = self.func(instance, *args)
12:02:11 INFO - 0:06.67 File "z:\task_1558437585\build\src\python\mozbuild\mozbuild\configure_init
.py", line 591, in _value_for_option
12:02:11 INFO - 0:06.67 % option_string.split('=', 1)[0])
12:02:11 INFO - 0:06.67 mozbuild.configure.options.InvalidOptionError: --enable-hardening is not available in this configuration
12:02:11 INFO - 0:06.69 *** Fix above errors and then restart with
12:02:11 INFO - 0:06.69 "./mach build"
12:02:11 INFO - 0:06.69 client.mk:111: recipe for target 'configure' failed
12:02:11 INFO - 0:06.69 mozmake.EXE: *** [configure] Error 1
12:02:11 ERROR - Return code: 2
12:02:11 ERROR - 2 not in success codes: [0]
12:02:11 WARNING - setting return code to 2
12:02:11 FATAL - Halting on failure while running ['c:\mozilla-build\python\python.exe', 'mach', 'configure']
12:02:11 FATAL - Running post_fatal callback...
12:02:11 FATAL - Exiting 2
12:02:11 INFO - [mozharness: 2019-05-21 12:02:11.162000Z] Finished setup step (failed)
[taskcluster 2019-05-21T12:02:11.178Z] Exit Code: 2
[taskcluster 2019-05-21T12:02:11.178Z] User Time: 0s
[taskcluster 2019-05-21T12:02:11.178Z] Kernel Time: 15.625ms
[taskcluster 2019-05-21T12:02:11.178Z] Wall Time: 1m48.1890531s
[taskcluster 2019-05-21T12:02:11.178Z] Result: FAILED
[taskcluster 2019-05-21T12:02:11.178Z] === Task Finished ===
[taskcluster 2019-05-21T12:02:11.178Z] Task Duration: 8m26.8853708s
[taskcluster 2019-05-21T12:02:11.483Z] Uploading artifact public/logs/localconfig.json from file logs\localconfig.json with content encoding "gzip", mime type "application/octet-stream" and expiry 2020-05-20T10:22:29.301Z
[taskcluster:error] Uploading error artifact public/build from file public/build with message "Could not read directory 'Z:\task_1558437585\public\build'", reason "file-missing-on-worker" and expiry 2020-05-20T10:22:29.301Z
[taskcluster:error] TASK FAILURE during artifact upload: file-missing-on-worker: Could not read directory 'Z:\task_1558437585\public\build'
[taskcluster 2019-05-21T12:02:12.482Z] Uploading artifact public/logs/certified.log from file generic-worker\certified.log with content encoding "gzip", mime type "text/plain; charset=utf-8" and expiry 2020-05-20T10:22:29.301Z
[taskcluster 2019-05-21T12:02:12.890Z] Uploading artifact public/chain-of-trust.json from file generic-worker\chain-of-trust.json with content encoding "gzip", mime type "text/plain; charset=utf-8" and expiry 2020-05-20T10:22:29.301Z
[taskcluster 2019-05-21T12:02:13.248Z] Uploading artifact public/chain-of-trust.json.sig from file generic-worker\chain-of-trust.json.sig with content encoding "gzip", mime type "application/octet-stream" and expiry 2020-05-20T10:22:29.301Z
[taskcluster 2019-05-21T12:02:13.383Z] [mounts] Preserving cache: Moving "Z:\task_1558437585\build" to "Z:\caches\bWal66s1TDupT8NOk7pxMQ"
[taskcluster 2019-05-21T12:02:14.006Z] [mounts] Denying task_1558437585 access to 'Z:\caches\bWal66s1TDupT8NOk7pxMQ'
[taskcluster 2019-05-21T12:02:30.837Z] Uploading redirect artifact public/logs/live.log to URL https://queue.taskcluster.net/v1/task/QkZ08AO6TvuRbTmix_6oGA/runs/0/artifacts/public/logs/live_backing.log with mime type "text/plain; charset=utf-8" and expiry 2020-05-20T10:22:29.301Z
[taskcluster:error] exit status 2
[taskcluster:error] file-missing-on-worker: Could not read directory 'Z:\task_1558437585\public\build'

Flags: needinfo?(dmajor)
Type: task → defect
Summary: L10n build bustages: mozbuild.configure.options.InvalidOptionError: --enable-hardening is not available in this configuration → Windows AArch64 L10n build bustages: mozbuild.configure.options.InvalidOptionError: --enable-hardening is not available in this configuration

I was out today and will look at this tomorrow.

Pushed by dmajor@mozilla.com:
https://hg.mozilla.org/integration/autoland/rev/ef47b8762dab
Get the arm64 hardening flag out of the way of l10n builds r=froydnj
Flags: needinfo?(dmajor)
Status: NEW → RESOLVED
Closed: 6 months ago
Resolution: --- → FIXED
Target Milestone: --- → mozilla69
Assignee: nobody → dmajor
You need to log in before you can comment on or make changes to this bug.