Closed Bug 1557592 Opened 6 years ago Closed 5 years ago

Intermittent ttest_restore_windows_after_restart_and_quit.py TestSessionStoreEnabledNoPrivateWindows.test_with_variety | IOError: Process killed after 120s because no connection to Marionette server could be established. Check gecko.log for errors

Categories

(Testing :: Firefox UI Tests, defect, P5)

Version 3
defect

Tracking

(Not tracked)

RESOLVED INCOMPLETE

People

(Reporter: intermittent-bug-filer, Unassigned)

References

Details

(Keywords: intermittent-failure, regression)

Filed by: ncsoregi [at] mozilla.com
Parsed log: https://treeherder.mozilla.org/logviewer.html#?job_id=250525088&repo=mozilla-beta
Full log: https://queue.taskcluster.net/v1/task/YgHyTGBZSy-wREkfoiuQig/runs/0/artifacts/public/logs/live_backing.log


[task 2019-06-07T01:16:39.911Z] 01:16:39 INFO - JavaScript error: chrome://browser/content/tabbrowser.js, line 778: TypeError: aURI is null
[task 2019-06-07T01:16:39.953Z] 01:16:39 INFO - Application command: /builds/worker/workspace/build/application/firefox/firefox -no-remote -marionette -profile /builds/worker/workspace/build/tmpMsvz9b.mozrunner
[task 2019-06-07T01:18:40.050Z] 01:18:40 INFO - TEST-UNEXPECTED-ERROR | testing/firefox-ui/tests/functional/sessionstore/test_restore_windows_after_restart_and_quit.py TestSessionStoreEnabledNoPrivateWindows.test_with_variety | IOError: Process killed after 120s because no connection to Marionette server could be established. Check gecko.log for errors
[task 2019-06-07T01:18:40.050Z] 01:18:40 INFO - Traceback (most recent call last):
[task 2019-06-07T01:18:40.050Z] 01:18:40 INFO - File "/builds/worker/workspace/build/venv/lib/python2.7/site-packages/marionette_harness/marionette_test/testcases.py", line 159, in run
[task 2019-06-07T01:18:40.052Z] 01:18:40 INFO - testMethod()
[task 2019-06-07T01:18:40.053Z] 01:18:40 INFO - File "/builds/worker/workspace/build/tests/firefox-ui/tests/testing/firefox-ui/tests/functional/sessionstore/test_restore_windows_after_restart_and_quit.py", line 37, in test_with_variety
[task 2019-06-07T01:18:40.054Z] 01:18:40 INFO - self.marionette.start_session()
[task 2019-06-07T01:18:40.055Z] 01:18:40 INFO - File "/builds/worker/workspace/build/venv/lib/python2.7/site-packages/marionette_driver/decorators.py", line 26, in _
[task 2019-06-07T01:18:40.056Z] 01:18:40 INFO - return func(*args, **kwargs)
[task 2019-06-07T01:18:40.057Z] 01:18:40 INFO - File "/builds/worker/workspace/build/venv/lib/python2.7/site-packages/marionette_driver/marionette.py", line 1103, in start_session
[task 2019-06-07T01:18:40.058Z] 01:18:40 INFO - self.start_binary(timeout)
[task 2019-06-07T01:18:40.059Z] 01:18:40 INFO - File "/builds/worker/workspace/build/venv/lib/python2.7/site-packages/marionette_driver/marionette.py", line 491, in start_binary
[task 2019-06-07T01:18:40.060Z] 01:18:40 INFO - reraise(IOError, msg.format(timeout), tb)
[task 2019-06-07T01:18:40.061Z] 01:18:40 INFO - File "/builds/worker/workspace/build/venv/lib/python2.7/site-packages/marionette_driver/marionette.py", line 482, in start_binary
[task 2019-06-07T01:18:40.062Z] 01:18:40 INFO - self.raise_for_port(timeout=timeout)
[task 2019-06-07T01:18:40.064Z] 01:18:40 INFO - File "/builds/worker/workspace/build/venv/lib/python2.7/site-packages/marionette_driver/marionette.py", line 569, in raise_for_port
[task 2019-06-07T01:18:40.065Z] 01:18:40 INFO - self.host, self.port))
[task 2019-06-07T01:18:40.066Z] 01:18:40 INFO - TEST-INFO took 133052ms
[task 2019-06-07T01:18:40.067Z] 01:18:40 ERROR - test_end for testing/firefox-ui/tests/functional/sessionstore/test_restore_windows_after_restart_and_quit.py TestSessionStoreEnabledNoPrivateWindows.test_with_variety logged while not in progress. Logged with data: {"status": "ERROR", "extra": {"class_name": "test_restore_windows_after_restart_and_quit.TestSessionStoreEnabledNoPrivateWindows", "method_name": "test_with_variety"}, "expected": "PASS", "test": "testing/firefox-ui/tests/functional/sessionstore/test_restore_windows_after_restart_and_quit.py TestSessionStoreEnabledNoPrivateWindows.test_with_variety", "message": "InvalidSessionIdException: Please start a session", "stack": "Traceback (most recent call last):\n File "/builds/worker/workspace/build/venv/lib/python2.7/site-packages/marionette_harness/marionette_test/testcases.py", line 190, in run\n self.tearDown()\n File "/builds/worker/workspace/build/tests/firefox-ui/tests/testing/firefox-ui/tests/functional/sessionstore/session_store_test_case.py", line 65, in tearDown\n super(SessionStoreTestCase, self).tearDown()\n File "/builds/worker/workspace/build/venv/lib/python2.7/site-packages/firefox_puppeteer/mixins.py", line 97, in tearDown\n self.marionette.set_context('chrome')\n File "/builds/worker/workspace/build/venv/lib/python2.7/site-packages/marionette_driver/marionette.py", line 1309, in set_context\n {"value": context})\n File "/builds/worker/workspace/build/venv/lib/python2.7/site-packages/marionette_driver/decorators.py", line 26, in _\n return func(*args, **kwargs)\n File "/builds/worker/workspace/build/venv/lib/python2.7/site-packages/marionette_driver/marionette.py", line 587, in _send_message\n raise errors.InvalidSessionIdException("Please start a session")\n"}
[task 2019-06-07T01:18:40.068Z] 01:18:40 INFO -
[task 2019-06-07T01:18:40.069Z] 01:18:40 INFO - SUMMARY
[task 2019-06-07T01:18:40.070Z] 01:18:40 INFO - -------
[task 2019-06-07T01:18:40.072Z] 01:18:40 INFO - passed: 58
[task 2019-06-07T01:18:40.073Z] 01:18:40 INFO - failed: 2
[task 2019-06-07T01:18:40.074Z] 01:18:40 INFO - todo: 3
[task 2019-06-07T01:18:40.075Z] 01:18:40 INFO -
[task 2019-06-07T01:18:40.076Z] 01:18:40 INFO - FAILED TESTS
[task 2019-06-07T01:18:40.077Z] 01:18:40 INFO - -------
[task 2019-06-07T01:18:40.078Z] 01:18:40 INFO - test_restore_windows_after_restart_and_quit.py test_restore_windows_after_restart_and_quit.TestSessionStoreEnabledNoPrivateWindows.test_with_variety
[task 2019-06-07T01:18:40.080Z] 01:18:40 INFO - test_restore_windows_after_restart_and_quit.py test_restore_windows_after_restart_and_quit.TestSessionStoreEnabledNoPrivateWindows.test_with_variety
[task 2019-06-07T01:18:40.081Z] 01:18:40 INFO - SUITE-END | took 355s
[task 2019-06-07T01:18:40.553Z] 01:18:40 ERROR - Return code: 10
[task 2019-06-07T01:18:40.555Z] 01:18:40 ERROR - Got 1 unexpected statuses
[task 2019-06-07T01:18:40.556Z] 01:18:40 ERROR - # TBPL FAILURE #

Status: NEW → RESOLVED
Closed: 5 years ago
Resolution: --- → INCOMPLETE
Status: RESOLVED → REOPENED
Resolution: INCOMPLETE → ---
Status: REOPENED → RESOLVED
Closed: 5 years ago5 years ago
Resolution: --- → INCOMPLETE
Status: REOPENED → RESOLVED
Closed: 5 years ago5 years ago
Resolution: --- → INCOMPLETE
You need to log in before you can comment on or make changes to this bug.