Intermittent mozmake.EXE[4]: *** [uiaRawElmProvider.obj] Error 1 | clang: error: clang frontend command failed due to signal
Categories
(Firefox Build System :: General, defect, P5)
Tracking
(Not tracked)
People
(Reporter: intermittent-bug-filer, Unassigned)
Details
(Keywords: intermittent-failure)
Filed by: apavel [at] mozilla.com
Parsed log: https://treeherder.mozilla.org/logviewer.html#?job_id=273728588&repo=autoland
Full log: https://queue.taskcluster.net/v1/task/GCTxVj0eRfCWllLwbBoYjA/runs/0/artifacts/public/logs/live_backing.log
[task 2019-10-30T18:02:12.009Z] 18:02:12 INFO - accessible/interfaces/gecko/IGeckoCustom_p.obj
[task 2019-10-30T18:02:12.009Z] 18:02:12 INFO - z:/build/fetches/sccache/sccache.exe z:/build/fetches/clang/bin/clang.exe --driver-mode=cl -Xclang -std=gnu99 -m32 -FoIGeckoCustom_p.obj -c -DNDEBUG=1 -DTRIMMED=1 -DSTATIC_EXPORTABLE_JS_API -DMOZ_HAS_MOZGLUE -DMOZILLA_INTERNAL_API -DIMPL_LIBXUL -Iz:/build/build/src/accessible/interfaces/gecko -Iz:/build/build/src/obj-firefox/accessible/interfaces/gecko -Iz:/build/build/src/obj-firefox/dist/include -Iz:/build/build/src/obj-firefox/dist/include/nspr -Iz:/build/build/src/obj-firefox/dist/include/nss -MD -FI z:/build/build/src/obj-firefox/mozilla-config.h -DMOZILLA_CLIENT -Qunused-arguments -guard:cf -fcrash-diagnostics-dir=z:/build/public/build -nologo -D_HAS_EXCEPTIONS=0 -guard:cf -W3 -Gy -Zc:inline -arch:SSE2 -Gw -Wno-unknown-pragmas -Wno-ignored-pragmas -Wno-deprecated-declarations -Wno-invalid-noreturn -Z7 -Xclang -load -Xclang z:/build/build/src/obj-firefox/build/clang-plugin/clang-plugin.dll -Xclang -add-plugin -Xclang moz-check -O2 -Oy- -Werror -Qunused-arguments -Wno-extern-initializer -Wno-incompatible-pointer-types -Wno-missing-braces -Wno-unused-const-variable -Xclang -MP -Xclang -dependency-file -Xclang .deps/IGeckoCustom_p.obj.pp -Xclang -MT -Xclang IGeckoCustom_p.obj IGeckoCustom_p.c
[task 2019-10-30T18:02:12.009Z] 18:02:12 INFO - mozmake.EXE[4]: Leaving directory 'z:/build/build/src/obj-firefox/accessible/interfaces/gecko'
[task 2019-10-30T18:02:12.049Z] 18:02:12 INFO - mozmake.EXE[4]: Entering directory 'z:/build/build/src/obj-firefox/accessible/windows/uia'
[task 2019-10-30T18:02:12.050Z] 18:02:12 INFO - z:/build/fetches/sccache/sccache.exe z:/build/fetches/clang/bin/clang.exe --driver-mode=cl -m32 -FouiaRawElmProvider.obj -c -Iz:/build/build/src/obj-firefox/dist/stl_wrappers -DNDEBUG=1 -DTRIMMED=1 -DWIN32_LEAN_AND_MEAN -D_WIN32 -DWIN32 -D_CRT_RAND_S -DCERT_CHAIN_PARA_HAS_EXTRA_FIELDS -DOS_WIN=1 -D_UNICODE -DCHROMIUM_BUILD -DU_STATIC_IMPLEMENTATION -DUNICODE -D_WINDOWS -D_SECURE_ATL -DCOMPILER_MSVC -DSTATIC_EXPORTABLE_JS_API -DMOZ_HAS_MOZGLUE -DMOZILLA_INTERNAL_API -DIMPL_LIBXUL -Iz:/build/build/src/accessible/windows/uia -Iz:/build/build/src/obj-firefox/accessible/windows/uia -Iz:/build/build/src/accessible/base -Iz:/build/build/src/accessible/generic -Iz:/build/build/src/accessible/html -Iz:/build/build/src/accessible/windows/msaa -Iz:/build/build/src/accessible/xpcom -Iz:/build/build/src/accessible/xul -Iz:/build/build/src/obj-firefox/ipc/ipdl/_ipdlheaders -Iz:/build/build/src/ipc/chromium/src -Iz:/build/build/src/ipc/glue -Iz:/build/build/src/obj-firefox/dist/include -Iz:/build/build/src/obj-firefox/dist/include/nspr -Iz:/build/build/src/obj-firefox/dist/include/nss -MD -FI z:/build/build/src/obj-firefox/mozilla-config.h -DMOZILLA_CLIENT -Qunused-arguments -guard:cf -Qunused-arguments -fcrash-diagnostics-dir=z:/build/public/build -TP -nologo -Zc:sizedDealloc- -D_HAS_EXCEPTIONS=0 -guard:cf -W3 -Gy -Zc:inline -arch:SSE2 -Gw -Wno-inline-new-delete -Wno-invalid-offsetof -Wno-microsoft-enum-value -Wno-microsoft-include -Wno-unknown-pragmas -Wno-ignored-pragmas -Wno-deprecated-declarations -Wno-invalid-noreturn -Wno-inconsistent-missing-override -Wno-implicit-exception-spec-mismatch -Wno-unused-local-typedef -Wno-ignored-attributes -Wno-used-but-marked-unused -D_SILENCE_TR1_NAMESPACE_DEPRECATION_WARNING -GR- -Z7 -Xclang -load -Xclang z:/build/build/src/obj-firefox/build/clang-plugin/clang-plugin.dll -Xclang -add-plugin -Xclang moz-check -O2 -Oy- -Werror -Xclang -MP -Xclang -dependency-file -Xclang .deps/uiaRawElmProvider.obj.pp -Xclang -MT -Xclang uiaRawElmProvider.obj z:/build/build/src/accessible/windows/uia/uiaRawElmProvider.cpp
[task 2019-10-30T18:02:12.050Z] 18:02:12 INFO - Stack dump:
[task 2019-10-30T18:02:12.050Z] 18:02:12 INFO - 0.Program arguments: z:\build\fetches\clang\bin\clang.exe -cc1 -triple i386-pc-windows-msvc19.15.26729 -emit-obj -mincremental-linker-compatible -disable-free -disable-llvm-verifier -discard-value-names -main-file-name uiaRawElmProvider.cpp -mrelocation-model static -mthread-model posix -mdisable-fp-elim -relaxed-aliasing -fmath-errno -masm-verbose -mconstructor-aliases -target-cpu pentium4 -mllvm -x86-asm-syntax=intel -D_MT -D_DLL --dependent-lib=msvcrt --dependent-lib=oldnames -fno-rtti-data -stack-protector 2 -fms-volatile -fdiagnostics-format msvc -cfguard -gcodeview -debug-info-kind=limited -momit-leaf-frame-pointer -ffunction-sections -fdata-sections -coverage-notes-file z:\build\build\src\obj-firefox\accessible\windows\uia\uiaRawElmProvider.gcno -resource-dir z:\build\fetches\clang\lib\clang\9.0.0 -include z:/build/build/src/obj-firefox/mozilla-config.h -I z:/build/build/src/obj-firefox/dist/stl_wrappers -D NDEBUG=1 -D TRIMMED=1 -D WIN32_LEAN_AND_MEAN -D _WIN32 -D WIN32 -D _CRT_RAND_S -D CERT_CHAIN_PARA_HAS_EXTRA_FIELDS -D OS_WIN=1 -D _UNICODE -D CHROMIUM_BUILD -D U_STATIC_IMPLEMENTATION -D UNICODE -D _WINDOWS -D _SECURE_ATL -D COMPILER_MSVC -D STATIC_EXPORTABLE_JS_API -D MOZ_HAS_MOZGLUE -D MOZILLA_INTERNAL_API -D IMPL_LIBXUL -I z:/build/build/src/accessible/windows/uia -I z:/build/build/src/obj-firefox/accessible/windows/uia -I z:/build/build/src/accessible/base -I z:/build/build/src/accessible/generic -I z:/build/build/src/accessible/html -I z:/build/build/src/accessible/windows/msaa -I z:/build/build/src/accessible/xpcom -I z:/build/build/src/accessible/xul -I z:/build/build/src/obj-firefox/ipc/ipdl/_ipdlheaders -I z:/build/build/src/ipc/chromium/src -I z:/build/build/src/ipc/glue -I z:/build/build/src/obj-firefox/dist/include -I z:/build/build/src/obj-firefox/dist/include/nspr -I z:/build/build/src/obj-firefox/dist/include/nss -D MOZILLA_CLIENT -D _HAS_EXCEPTIONS=0 -D _SILENCE_TR1_NAMESPACE_DEPRECATION_WARNING -internal-isystem z:\build\fetches\clang\lib\clang\9.0.0\include -internal-isystem z:\build\build\src\vs2017_15.8.4\VC\include -internal-isystem z:\build\build\src\vs2017_15.8.4\VC\atlmfc\include -internal-isystem z:/build/build/src/vs2017_15.8.4/SDK\include\10.0.17134.0\shared -internal-isystem z:/build/build/src/vs2017_15.8.4/SDK\include\10.0.17134.0\um -internal-isystem z:/build/build/src/vs2017_15.8.4/SDK\include\10.0.17134.0\winrt -internal-isystem z:/build/build/src/vs2017_15.8.4/SDK\include\10.0.17134.0\ucrt -internal-isystem z:\build\build\src\vs2017_15.8.4\DIA SDK\include -O2 -Wall -Wno-inline-new-delete -Wno-invalid-offsetof -Wno-microsoft-enum-value -Wno-microsoft-include -Wno-unknown-pragmas -Wno-ignored-pragmas -Wno-deprecated-declarations -Wno-invalid-noreturn -Wno-inconsistent-missing-override -Wno-implicit-exception-spec-mismatch -Wno-unused-local-typedef -Wno-ignored-attributes -Wno-used-but-marked-unused -Werror -fdeprecated-macro -fdebug-compilation-dir z:\build\build\src\obj-firefox\accessible\windows\uia -ferror-limit 19 -fmessage-length 0 -fno-use-cxa-atexit -fms-extensions -fms-compatibility -fms-compatibility-version=19.15.26729 -std=c++14 -fdelayed-template-parsing -fobjc-runtime=gcc -fdiagnostics-show-option -vectorize-loops -vectorize-slp -MP -dependency-file .deps/uiaRawElmProvider.obj.pp -MT uiaRawElmProvider.obj -load z:/build/build/src/obj-firefox/build/clang-plugin/clang-plugin.dll -add-plugin moz-check -faddrsig -o uiaRawElmProvider.obj -x c++ z:/build/build/src/accessible/windows/uia/uiaRawElmProvider.cpp
[task 2019-10-30T18:02:12.051Z] 18:02:12 INFO - 1.z:/build/build/src/obj-firefox/dist/include/mozilla/LinkedList.h:480:64: current parser token ')'
[task 2019-10-30T18:02:12.051Z] 18:02:12 INFO - 2.z:/build/build/src/obj-firefox/dist/include/mozilla/LinkedList.h:75:1: parsing namespace 'mozilla'
[task 2019-10-30T18:02:12.051Z] 18:02:12 INFO - 3.z:/build/build/src/obj-firefox/dist/include/mozilla/LinkedList.h:386:1: parsing struct/union/class body 'mozilla::LinkedList'
[task 2019-10-30T18:02:12.052Z] 18:02:12 INFO - #0 0x00007ff677ea0ce7 clang::Parser::ConsumeAndStoreUntil(enum clang::tok::TokenKind,enum clang::tok::TokenKind,class llvm::SmallVector<class clang::Token,4> &,bool,bool) (z:\build\fetches\clang\bin\clang.exe+0x2110ce7)
[task 2019-10-30T18:02:12.052Z] 18:02:12 INFO - #1 0x00007ff677ea0fdd clang::Parser::ConsumeAndStoreUntil(enum clang::tok::TokenKind,enum clang::tok::TokenKind,class llvm::SmallVector<class clang::Token,4> &,bool,bool) (z:\build\fetches\clang\bin\clang.exe+0x2110fdd)
[task 2019-10-30T18:02:12.052Z] 18:02:12 INFO - #2 0x00007ff677e36e28 clang::Parser::LexTemplateFunctionForLateParsing(class llvm::SmallVector<class clang::Token,4> &) (z:\build\fetches\clang\bin\clang.exe+0x20a6e28)
[task 2019-10-30T18:02:12.052Z] 18:02:12 INFO - #3 0x00007ff677e9d036 clang::Parser::ParseCXXInlineMethodDef(enum clang::AccessSpecifier,class clang::ParsedAttributes &,class clang::ParsingDeclarator &,struct clang::Parser::ParsedTemplateInfo const &,class clang::VirtSpecifiers const &,class clang::SourceLocation) (z:\build\fetches\clang\bin\clang.exe+0x210d036)
[task 2019-10-30T18:02:12.052Z] 18:02:12 INFO - #4 0x00007ff677e4c54b clang::Parser::ParseCXXClassMemberDeclaration(enum clang::AccessSpecifier,class clang::ParsedAttributes &,struct clang::Parser::ParsedTemplateInfo const &,class clang::ParsingDeclRAIIObject *) (z:\build\fetches\clang\bin\clang.exe+0x20bc54b)
[task 2019-10-30T18:02:12.052Z] 18:02:12 INFO - #5 0x00007ff677e4d19a clang::Parser::ParseCXXClassMemberDeclarationWithPragmas(enum clang::AccessSpecifier &,struct clang::Parser::ParsedAttributesWithRange &,enum clang::TypeSpecifierType,class clang::Decl *) (z:\build\fetches\clang\bin\clang.exe+0x20bd19a)
[task 2019-10-30T18:02:12.053Z] 18:02:12 INFO - #6 0x00007ff677e478c0 clang::Parser::ParseCXXMemberSpecification(class clang::SourceLocation,class clang::SourceLocation,struct clang::Parser::ParsedAttributesWithRange &,unsigned int,class clang::Decl *) (z:\build\fetches\clang\bin\clang.exe+0x20b78c0)
[task 2019-10-30T18:02:12.053Z] 18:02:12 INFO - #7 0x00007ff677e45042 clang::Parser::ParseClassSpecifier(enum clang::tok::TokenKind,class clang::SourceLocation,class clang::DeclSpec &,struct clang::Parser::ParsedTemplateInfo const &,enum clang::AccessSpecifier,bool,enum clang::Parser::DeclSpecContext,struct clang::Parser::ParsedAttributesWithRange &) (z:\build\fetches\clang\bin\clang.exe+0x20b5042)
[task 2019-10-30T18:02:12.053Z] 18:02:12 INFO - #8 0x00007ff677e5d52e clang::Parser::ParseDeclarationSpecifiers(class clang::DeclSpec &,struct clang::Parser::ParsedTemplateInfo const &,enum clang::AccessSpecifier,enum clang::Parser::DeclSpecContext,class clang::Parser::LateParsedAttrList *) (z:\build\fetches\clang\bin\clang.exe+0x20cd52e)
[task 2019-10-30T18:02:12.053Z] 18:02:12 INFO - #9 0x00007ff677e316e4 clang::Parser::ParseSingleDeclarationAfterTemplate(enum clang::DeclaratorContext,struct clang::Parser::ParsedTemplateInfo const &,class clang::ParsingDeclRAIIObject &,class clang::SourceLocation &,class clang::ParsedAttributes &,enum clang::AccessSpecifier) (z:\build\fetches\clang\bin\clang.exe+0x20a16e4)
[task 2019-10-30T18:02:12.053Z] 18:02:12 INFO - #10 0x00007ff677e30b05 clang::Parser::ParseTemplateDeclarationOrSpecialization(enum clang::DeclaratorContext,class clang::SourceLocation &,class clang::ParsedAttributes &,enum clang::AccessSpecifier) (z:\build\fetches\clang\bin\clang.exe+0x20a0b05)
[task 2019-10-30T18:02:12.054Z] 18:02:12 INFO - #11 0x00007ff677e303e9 clang::Parser::ParseDeclarationStartingWithTemplate(enum clang::DeclaratorContext,class clang::SourceLocation &,class clang::ParsedAttributes &,enum clang::AccessSpecifier) (z:\build\fetches\clang\bin\clang.exe+0x20a03e9)
[task 2019-10-30T18:02:12.054Z] 18:02:12 INFO - #12 0x00007ff677e5c994 clang::Parser::ParseDeclaration(enum clang::DeclaratorContext,class clang::SourceLocation &,struct clang::Parser::ParsedAttributesWithRange &) (z:\build\fetches\clang\bin\clang.exe+0x20cc994)
[task 2019-10-30T18:02:12.054Z] 18:02:12 INFO - #13 0x00007ff677e15f34 clang::Parser::ParseExternalDeclaration(struct clang::Parser::ParsedAttributesWithRange &,class clang::ParsingDeclSpec *) (z:\build\fetches\clang\bin\clang.exe+0x2085f34)
[task 2019-10-30T18:02:12.054Z] 18:02:12 INFO - #14 0x00007ff677e3e380 clang::Parser::ParseInnerNamespace(class llvm::SmallVector<struct clang::Parser::InnerNamespaceInfo,4> const &,unsigned int,class clang::SourceLocation &,class clang::ParsedAttributes &,class clang::BalancedDelimiterTracker &) (z:\build\fetches\clang\bin\clang.exe+0x20ae380)
[task 2019-10-30T18:02:12.054Z] 18:02:12 INFO - #15 0x00007ff677e3d54d clang::Parser::ParseNamespace(enum clang::DeclaratorContext,class clang::SourceLocation &,class clang::SourceLocation) (z:\build\fetches\clang\bin\clang.exe+0x20ad54d)
[task 2019-10-30T18:02:12.054Z] 18:02:12 INFO - #16 0x00007ff677e5ca90 clang::Parser::ParseDeclaration(enum clang::DeclaratorContext,class clang::SourceLocation &,struct clang::Parser::ParsedAttributesWithRange &) (z:\build\fetches\clang\bin\clang.exe+0x20cca90)
[task 2019-10-30T18:02:12.054Z] 18:02:12 INFO - #17 0x00007ff677e15f34 clang::Parser::ParseExternalDeclaration(struct clang::Parser::ParsedAttributesWithRange &,class clang::ParsingDeclSpec *) (z:\build\fetches\clang\bin\clang.exe+0x2085f34)
[task 2019-10-30T18:02:12.054Z] 18:02:12 INFO - #18 0x00007ff677e14910 clang::Parser::ParseTopLevelDecl(class clang::OpaquePtr<class clang::DeclGroupRef> &,bool) (z:\build\fetches\clang\bin\clang.exe+0x2084910)
[task 2019-10-30T18:02:12.054Z] 18:02:12 INFO - #19 0x00007ff677e0fe3e clang::ParseAST(class clang::Sema &,bool,bool) (z:\build\fetches\clang\bin\clang.exe+0x207fe3e)
[task 2019-10-30T18:02:12.054Z] 18:02:12 INFO - #20 0x00007ff6772c0472 clang::FrontendAction::Execute(void) (z:\build\fetches\clang\bin\clang.exe+0x1530472)
[task 2019-10-30T18:02:12.054Z] 18:02:12 INFO - #21 0x00007ff6772842ef clang::CompilerInstance::ExecuteAction(class clang::FrontendAction &) (z:\build\fetches\clang\bin\clang.exe+0x14f42ef)
[task 2019-10-30T18:02:12.055Z] 18:02:12 INFO - #22 0x00007ff677323bc7 clang::ExecuteCompilerInvocation(class clang::CompilerInstance *) (z:\build\fetches\clang\bin\clang.exe+0x1593bc7)
[task 2019-10-30T18:02:12.055Z] 18:02:12 INFO - #23 0x00007ff675d96ff4 clang::ChainedDiagnosticConsumer::HandleDiagnostic(enum clang::DiagnosticsEngine::Level,class clang::Diagnostic const &) (z:\build\fetches\clang\bin\clang.exe+0x6ff4)
[task 2019-10-30T18:02:12.055Z] 18:02:12 INFO - #24 0x00007ff675d9442f (z:\build\fetches\clang\bin\clang.exe+0x442f)
[task 2019-10-30T18:02:12.056Z] 18:02:12 INFO - #25 0x00007ff678d912a0 llvm::itanium_demangle::OutputStream::writeUnsigned(unsigned __int64,bool) (z:\build\fetches\clang\bin\clang.exe+0x30012a0)
[task 2019-10-30T18:02:12.056Z] 18:02:12 INFO - #26 0x00007fff100913d2 (C:\Windows\system32\KERNEL32.DLL+0x13d2)
[task 2019-10-30T18:02:12.056Z] 18:02:12 INFO - #27 0x00007fff104754e4 (C:\Windows\SYSTEM32\ntdll.dll+0x154e4)
[task 2019-10-30T18:02:12.056Z] 18:02:12 INFO - clang: error: clang frontend command failed due to signal (use -v to see invocation)
[task 2019-10-30T18:02:12.057Z] 18:02:12 INFO - clang version 9.0.0
[task 2019-10-30T18:02:12.057Z] 18:02:12 INFO - Target: i386-pc-windows-msvc
[task 2019-10-30T18:02:12.057Z] 18:02:12 INFO - Thread model: posix
[task 2019-10-30T18:02:12.057Z] 18:02:12 INFO - InstalledDir: z:/build/fetches/clang/bin
[task 2019-10-30T18:02:12.057Z] 18:02:12 INFO - clang: note: diagnostic msg: PLEASE submit a bug report to https://bugs.llvm.org/ and include the crash backtrace, preprocessed source, and associated run script.
[task 2019-10-30T18:02:12.057Z] 18:02:12 INFO - clang: note: diagnostic msg:
[task 2019-10-30T18:02:12.057Z] 18:02:12 INFO - ********************
[task 2019-10-30T18:02:12.057Z] 18:02:12 INFO - PLEASE ATTACH THE FOLLOWING FILES TO THE BUG REPORT:
[task 2019-10-30T18:02:12.057Z] 18:02:12 INFO - Preprocessed source(s) and associated run script(s) are located at:
[task 2019-10-30T18:02:12.057Z] 18:02:12 INFO - clang: note: diagnostic msg: z:/build/public/build\uiaRawElmProvider-5ae9bb.cpp
[task 2019-10-30T18:02:12.058Z] 18:02:12 INFO - clang: note: diagnostic msg: z:/build/public/build\uiaRawElmProvider-5ae9bb.sh
[task 2019-10-30T18:02:12.058Z] 18:02:12 INFO - clang: note: diagnostic msg:
[task 2019-10-30T18:02:12.058Z] 18:02:12 INFO - ********************
[task 2019-10-30T18:02:12.058Z] 18:02:12 INFO - z:/build/build/src/config/rules.mk:787: recipe for target 'uiaRawElmProvider.obj' failed
[task 2019-10-30T18:02:12.058Z] 18:02:12 INFO - mozmake.EXE[4]: *** [uiaRawElmProvider.obj] Error 1
[task 2019-10-30T18:02:12.058Z] 18:02:12 INFO - mozmake.EXE[4]: Leaving directory 'z:/build/build/src/obj-firefox/accessible/windows/uia'
[task 2019-10-30T18:02:12.058Z] 18:02:12 INFO - mozmake.EXE[4]: Entering directory 'z:/build/build/src/obj-firefox/accessible/interfaces/ia2'
[task 2019-10-30T18:02:12.058Z] 18:02:12 INFO - mkdir -p '.deps/'
[task 2019-10-30T18:02:12.058Z] 18:02:12 INFO - mozmake.EXE[4]: Leaving directory 'z:/build/build/src/obj-firefox/accessible/interfaces/ia2'
[task 2019-10-30T18:02:12.059Z] 18:02:12 INFO - z:/build/build/src/config/recurse.mk:74: recipe for target 'accessible/windows/uia/target-objects' failed
[task 2019-10-30T18:02:12.059Z] 18:02:12 INFO - mozmake.EXE[3]: *** [accessible/windows/uia/target-objects] Error 2
[task 2019-10-30T18:02:12.059Z] 18:02:12 INFO - mozmake.EXE[3]: *** Waiting for unfinished jobs....
[task 2019-10-30T18:02:12.079Z] 18:02:12 INFO - mozmake.EXE[4]: Entering directory 'z:/build/build/src/obj-firefox/accessible/interfaces/msaa'
[task 2019-10-30T18:02:12.079Z] 18:02:12 INFO - accessible/interfaces/msaa/AccessibleMarshalThunk.obj
| Comment hidden (Intermittent Failures Robot) |
Comment 2•6 years ago
|
||
https://wiki.mozilla.org/Bug_Triage#Intermittent_Test_Failure_Cleanup
For more information, please visit auto_nag documentation.
Description
•