Closed Bug 1612026 Opened 5 years ago Closed 5 years ago

Intermittent testing\firefox-ui\tests\functional\sessionstore\test_restore_windows_after_windows_shutdown.py TestWindowsShutdownRegisterRestart.test_manual_restart | IOError: Process killed after 120s because no connection to Marionette server could be es

Categories

(Testing :: Firefox UI Tests, defect, P5)

Version 3
defect

Tracking

(Not tracked)

RESOLVED INCOMPLETE

People

(Reporter: intermittent-bug-filer, Unassigned)

References

Details

(Keywords: intermittent-failure)

Filed by: rmaries [at] mozilla.com
Parsed log: https://treeherder.mozilla.org/logviewer.html#?job_id=286793679&repo=autoland
Full log: https://firefox-ci-tc.services.mozilla.com/api/queue/v1/task/ZwgeDodLRUmXQg4P813A8A/runs/0/artifacts/public/logs/live_backing.log


[task 2020-01-29T02:35:19.555Z] 02:35:19 INFO - TEST-START | testing\firefox-ui\tests\functional\sessionstore\test_restore_windows_after_windows_shutdown.py TestWindowsShutdownRegisterRestart.test_manual_restart
[task 2020-01-29T02:37:39.115Z] 02:37:39 INFO - TEST-UNEXPECTED-ERROR | testing\firefox-ui\tests\functional\sessionstore\test_restore_windows_after_windows_shutdown.py TestWindowsShutdownRegisterRestart.test_manual_restart | IOError: Process killed after 120s because no connection to Marionette server could be established. Check gecko.log for errors
[task 2020-01-29T02:37:39.115Z] 02:37:39 INFO - Traceback (most recent call last):
[task 2020-01-29T02:37:39.115Z] 02:37:39 INFO - File "Z:\task_1580263099\build\venv\lib\site-packages\marionette_harness\marionette_test\testcases.py", line 159, in run
[task 2020-01-29T02:37:39.115Z] 02:37:39 INFO - testMethod()
[task 2020-01-29T02:37:39.115Z] 02:37:39 INFO - File "Z:\task_1580263099\build\tests\firefox-ui\tests\testing\firefox-ui\tests\functional\sessionstore\test_restore_windows_after_windows_shutdown.py", line 45, in test_manual_restart
[task 2020-01-29T02:37:39.116Z] 02:37:39 INFO - self.windows_shutdown_with_variety(restart_by_os=False, expect_restore=True)
[task 2020-01-29T02:37:39.116Z] 02:37:39 INFO - File "Z:\task_1580263099\build\tests\firefox-ui\tests\testing\firefox-ui\tests\functional\sessionstore\session_store_test_case.py", line 318, in windows_shutdown_with_variety
[task 2020-01-29T02:37:39.116Z] 02:37:39 INFO - self.marionette.start_session()
[task 2020-01-29T02:37:39.116Z] 02:37:39 INFO - File "Z:\task_1580263099\build\venv\lib\site-packages\marionette_driver\decorators.py", line 26, in _
[task 2020-01-29T02:37:39.116Z] 02:37:39 INFO - return func(*args, **kwargs)
[task 2020-01-29T02:37:39.116Z] 02:37:39 INFO - File "Z:\task_1580263099\build\venv\lib\site-packages\marionette_driver\marionette.py", line 1103, in start_session
[task 2020-01-29T02:37:39.116Z] 02:37:39 INFO - self.start_binary(timeout)
[task 2020-01-29T02:37:39.116Z] 02:37:39 INFO - File "Z:\task_1580263099\build\venv\lib\site-packages\marionette_driver\marionette.py", line 491, in start_binary
[task 2020-01-29T02:37:39.116Z] 02:37:39 INFO - reraise(IOError, msg.format(timeout), tb)
[task 2020-01-29T02:37:39.116Z] 02:37:39 INFO - File "Z:\task_1580263099\build\venv\lib\site-packages\marionette_driver\marionette.py", line 482, in start_binary
[task 2020-01-29T02:37:39.116Z] 02:37:39 INFO - self.raise_for_port(timeout=timeout)
[task 2020-01-29T02:37:39.116Z] 02:37:39 INFO - File "Z:\task_1580263099\build\venv\lib\site-packages\marionette_driver\marionette.py", line 569, in raise_for_port
[task 2020-01-29T02:37:39.116Z] 02:37:39 INFO - self.host, self.port))
[task 2020-01-29T02:37:39.116Z] 02:37:39 INFO - TEST-INFO took 139557ms
[task 2020-01-29T02:37:39.117Z] 02:37:39 ERROR - test_end for testing\firefox-ui\tests\functional\sessionstore\test_restore_windows_after_windows_shutdown.py TestWindowsShutdownRegisterRestart.test_manual_restart logged while not in progress. Logged with data: {"status": "ERROR", "extra": {"class_name": "test_restore_windows_after_windows_shutdown.TestWindowsShutdownRegisterRestart", "method_name": "test_manual_restart"}, "expected": "PASS", "test": "testing\firefox-ui\tests\functional\sessionstore\test_restore_windows_after_windows_shutdown.py TestWindowsShutdownRegisterRestart.test_manual_restart", "message": "InvalidSessionIdException: Please start a session", "stack": "Traceback (most recent call last):\n File "Z:\task_1580263099\build\venv\lib\site-packages\marionette_harness\marionette_test\testcases.py", line 190, in run\n self.tearDown()\n File "Z:\task_1580263099\build\tests\firefox-ui\tests\testing\firefox-ui\tests\functional\sessionstore\session_store_test_case.py", line 66, in tearDown\n super(SessionStoreTestCase, self).tearDown()\n File "Z:\task_1580263099\build\venv\lib\site-packages\firefox_puppeteer\mixins.py", line 97, in tearDown\n self.marionette.set_context('chrome')\n File "Z:\task_1580263099\build\venv\lib\site-packages\marionette_driver\marionette.py", line 1309, in set_context\n {"value": context})\n File "Z:\task_1580263099\build\venv\lib\site-packages\marionette_driver\decorators.py", line 26, in _\n return func(*args, **kwargs)\n File "Z:\task_1580263099\build\venv\lib\site-packages\marionette_driver\marionette.py", line 587, in _send_message\n raise errors.InvalidSessionIdException("Please start a session")\n"}
[task 2020-01-29T02:37:39.117Z] 02:37:39 INFO -
[task 2020-01-29T02:37:39.117Z] 02:37:39 INFO - SUMMARY
[task 2020-01-29T02:37:39.117Z] 02:37:39 INFO - -------
[task 2020-01-29T02:37:39.117Z] 02:37:39 INFO - passed: 49
[task 2020-01-29T02:37:39.117Z] 02:37:39 INFO - failed: 2
[task 2020-01-29T02:37:39.117Z] 02:37:39 INFO - todo: 0
[task 2020-01-29T02:37:39.117Z] 02:37:39 INFO -
[task 2020-01-29T02:37:39.117Z] 02:37:39 INFO - FAILED TESTS
[task 2020-01-29T02:37:39.117Z] 02:37:39 INFO - -------
[task 2020-01-29T02:37:39.117Z] 02:37:39 INFO - test_restore_windows_after_windows_shutdown.py test_restore_windows_after_windows_shutdown.TestWindowsShutdownRegisterRestart.test_manual_restart
[task 2020-01-29T02:37:39.118Z] 02:37:39 INFO - test_restore_windows_after_windows_shutdown.py test_restore_windows_after_windows_shutdown.TestWindowsShutdownRegisterRestart.test_manual_restart

Status: NEW → RESOLVED
Closed: 5 years ago
Resolution: --- → INCOMPLETE
You need to log in before you can comment on or make changes to this bug.