Closed
Bug 1618653
Opened 6 years ago
Closed 6 years ago
[wpt-sync] Sync PR 22011 - Update chromium logger with more artifacts and PRECONDITION_FAILED support
Categories
(Testing :: web-platform-tests, task, P4)
Testing
web-platform-tests
Tracking
(firefox75 fixed)
RESOLVED
FIXED
mozilla75
| Tracking | Status | |
|---|---|---|
| firefox75 | --- | fixed |
People
(Reporter: wpt-sync, Unassigned)
References
()
Details
(Whiteboard: [wptsync downstream])
Sync web-platform-tests PR 22011 into mozilla-central (this bug is closed when the sync is complete).
PR: https://github.com/web-platform-tests/wpt/pull/22011
Details from upstream follow.
Luke Zielinski <lpz@chromium.org> wrote:
Update chromium logger with more artifacts and PRECONDITION_FAILED support
This adds two new artifacts for 1) subtest failures and 2) the actual
status reported by WPT. These are used on the Chromium side as hints for
defining expectations, which can then be mapped back to WPT Metadata
files more accurately.We also handle PRECONDITION_FAILED status, which gets mapped to
FAIL for Chromium.
| Assignee | ||
Comment 1•6 years ago
|
||
Pushed by wptsync@mozilla.com:
https://hg.mozilla.org/integration/autoland/rev/30f74fcbd3aa
[wpt PR 22011] - Update chromium logger with more artifacts and PRECONDITION_FAILED support, a=testonly
| Assignee | ||
Comment 3•6 years ago
|
||
Test result changes from PR not available.
Comment 4•6 years ago
|
||
| bugherder | ||
Status: NEW → RESOLVED
Closed: 6 years ago
status-firefox75:
--- → fixed
Resolution: --- → FIXED
Target Milestone: --- → mozilla75
You need to log in
before you can comment on or make changes to this bug.
Description
•