Closed Bug 1620232 Opened 2 years ago Closed 2 years ago

Perma build bustages on VerifySSLServerCertParent.cpp when Gecko 75 merges to Beta on 2020-03-09

Categories

(Core :: Security: PSM, defect)

defect
Not set
major

Tracking

()

VERIFIED FIXED
mozilla75
Tracking Status
firefox-esr68 --- unaffected
firefox73 --- unaffected
firefox74 --- unaffected
firefox75 blocking verified

People

(Reporter: aciure, Assigned: kershaw)

References

(Regression)

Details

Attachments

(1 file)

Central as Beta Simulation:
https://treeherder.mozilla.org/#/jobs?repo=try&selectedJob=291780827&resultStatus=busted%2Cexception%2Crunnable&revision=4b7e8a27885cb0bcb0067e7d4bfa2a1dbb1037c1

log: https://treeherder.mozilla.org/logviewer.html#/jobs?job_id=291780753&repo=try&lineNumber=44370
[task 2020-03-05T11:00:26.179Z] 11:00:26 INFO - make[4]: Entering directory '/builds/worker/workspace/build/src/obj-firefox/toolkit/components/mozintl'
[task 2020-03-05T11:00:26.179Z] 11:00:26 INFO - mkdir -p '.deps/'
[task 2020-03-05T11:00:26.179Z] 11:00:26 INFO - make[4]: Leaving directory '/builds/worker/workspace/build/src/obj-firefox/toolkit/components/mozintl'
[task 2020-03-05T11:00:26.179Z] 11:00:26 INFO - make[4]: Entering directory '/builds/worker/workspace/build/src/obj-firefox/toolkit/components/mozintl'
[task 2020-03-05T11:00:26.179Z] 11:00:26 INFO - toolkit/components/mozintl/MozIntlHelper.o
[task 2020-03-05T11:00:26.179Z] 11:00:26 INFO - make[4]: Leaving directory '/builds/worker/workspace/build/src/obj-firefox/toolkit/components/mozintl'
[task 2020-03-05T11:00:26.199Z] 11:00:26 INFO - make[4]: Entering directory '/builds/worker/workspace/build/src/obj-firefox/toolkit/components/mediasniffer'
[task 2020-03-05T11:00:26.199Z] 11:00:26 INFO - toolkit/components/mediasniffer/Unified_c_mediasniffer0.o
[task 2020-03-05T11:00:26.199Z] 11:00:26 INFO - /builds/worker/fetches/sccache/sccache /builds/worker/fetches/gcc/bin/gcc -std=gnu99 -o Unified_c_mediasniffer0.o -c -I/builds/worker/workspace/build/src/obj-firefox/dist/system_wrappers -include /builds/worker/workspace/build/src/config/gcc_hidden.h -U_FORTIFY_SOURCE -D_FORTIFY_SOURCE=2 -fstack-protector-strong -DNDEBUG=1 -DTRIMMED=1 -DMOZ_HAS_MOZGLUE -DMOZILLA_INTERNAL_API -DIMPL_LIBXUL -DSTATIC_EXPORTABLE_JS_API -I/builds/worker/workspace/build/src/toolkit/components/mediasniffer -I/builds/worker/workspace/build/src/obj-firefox/toolkit/components/mediasniffer -I/builds/worker/workspace/build/src/obj-firefox/dist/include -I/builds/worker/workspace/build/src/obj-firefox/dist/include/nspr -I/builds/worker/workspace/build/src/obj-firefox/dist/include/nss -fPIC -include /builds/worker/workspace/build/src/obj-firefox/mozilla-config.h -DMOZILLA_CLIENT -fno-strict-aliasing -ffunction-sections -fdata-sections -fno-math-errno -pthread -fPIC -pipe -g -freorder-blocks -O2 -fno-omit-frame-pointer -funwind-tables -Werror -Wall -Wempty-body -Wignored-qualifiers -Wpointer-arith -Wsign-compare -Wtype-limits -Wunreachable-code -Wduplicated-cond -Wno-error=maybe-uninitialized -Wno-error=deprecated-declarations -Wno-error=array-bounds -Wno-error=coverage-mismatch -Wno-error=free-nonheap-object -Wformat -Wformat-overflow=2 -MD -MP -MF .deps/Unified_c_mediasniffer0.o.pp Unified_c_mediasniffer0.c
[task 2020-03-05T11:00:26.199Z] 11:00:26 INFO - make[4]: Leaving directory '/builds/worker/workspace/build/src/obj-firefox/toolkit/components/mediasniffer'
[task 2020-03-05T11:00:26.199Z] 11:00:26 INFO - make[4]: Entering directory '/builds/worker/workspace/build/src/obj-firefox/toolkit/components/mediasniffer'
[task 2020-03-05T11:00:26.199Z] 11:00:26 INFO - toolkit/components/mediasniffer/Unified_cpp_mediasniffer0.o
[task 2020-03-05T11:00:26.200Z] 11:00:26 INFO - make[4]: Leaving directory '/builds/worker/workspace/build/src/obj-firefox/toolkit/components/mediasniffer'
[task 2020-03-05T11:00:26.237Z] 11:00:26 INFO - make[4]: Entering directory '/builds/worker/workspace/build/src/obj-firefox/security/manager/ssl'
[task 2020-03-05T11:00:26.237Z] 11:00:26 INFO - /builds/worker/fetches/sccache/sccache /builds/worker/fetches/gcc/bin/g++ -std=gnu++17 -o Unified_cpp_security_manager_ssl1.o -c -I/builds/worker/workspace/build/src/obj-firefox/dist/stl_wrappers -I/builds/worker/workspace/build/src/obj-firefox/dist/system_wrappers -include /builds/worker/workspace/build/src/config/gcc_hidden.h -U_FORTIFY_SOURCE -D_FORTIFY_SOURCE=2 -fstack-protector-strong -DNDEBUG=1 -DTRIMMED=1 -DSSL_DISABLE_DEPRECATED_CIPHER_SUITE_NAMES=True -DNSS_ENABLE_ECC=True -DOS_POSIX=1 -DOS_LINUX=1 -DMOZ_HAS_MOZGLUE -DMOZILLA_INTERNAL_API -DIMPL_LIBXUL -DSTATIC_EXPORTABLE_JS_API -I/builds/worker/workspace/build/src/security/manager/ssl -I/builds/worker/workspace/build/src/obj-firefox/security/manager/ssl -I/builds/worker/workspace/build/src/dom/base -I/builds/worker/workspace/build/src/dom/crypto -I/builds/worker/workspace/build/src/netwerk/base -I/builds/worker/workspace/build/src/security/certverifier -I/builds/worker/workspace/build/src/obj-firefox/dist/public/nss -I/builds/worker/workspace/build/src/obj-firefox/ipc/ipdl/_ipdlheaders -I/builds/worker/workspace/build/src/ipc/chromium/src -I/builds/worker/workspace/build/src/ipc/glue -I/builds/worker/workspace/build/src/obj-firefox/dist/include -I/builds/worker/workspace/build/src/obj-firefox/dist/include/nspr -I/builds/worker/workspace/build/src/obj-firefox/dist/include/nss -fPIC -DMOZILLA_CLIENT -include /builds/worker/workspace/build/src/obj-firefox/mozilla-config.h -Wall -Wempty-body -Wignored-qualifiers -Woverloaded-virtual -Wpointer-arith -Wsign-compare -Wtype-limits -Wunreachable-code -Wwrite-strings -Wno-invalid-offsetof -Wduplicated-cond -Wimplicit-fallthrough -Wunused-function -Wunused-variable -Wno-error=maybe-uninitialized -Wno-error=deprecated-declarations -Wno-error=array-bounds -Wno-error=coverage-mismatch -Wno-error=free-nonheap-object -Wformat -Wformat-overflow=2 -D_GLIBCXX_USE_CXX11_ABI=0 -fno-sized-deallocation -fno-aligned-new -fno-exceptions -fno-strict-aliasing -fno-rtti -ffunction-sections -fdata-sections -fno-exceptions -fno-math-errno -pthread -pipe -g -freorder-blocks -O2 -fno-omit-frame-pointer -funwind-tables -Werror -I/usr/include/glib-2.0 -I/usr/lib/x86_64-linux-gnu/glib-2.0/include -Wextra -Wno-missing-field-initializers -Wno-unused-parameter -MD -MP -MF .deps/Unified_cpp_security_manager_ssl1.o.pp Unified_cpp_security_manager_ssl1.cpp
[task 2020-03-05T11:00:26.237Z] 11:00:26 INFO - In file included from Unified_cpp_security_manager_ssl1.cpp:56:0:
[task 2020-03-05T11:00:26.237Z] 11:00:26 INFO - /builds/worker/workspace/build/src/security/manager/ssl/VerifySSLServerCertParent.cpp: In member function 'virtual void mozilla::psm::{anonymous}::IPCServerCertVerificationResult::Dispatch(nsNSSCertificate*, nsTArray<nsTArray<unsigned char> >&&, nsTArray<nsTArray<unsigned char> >&&, uint16_t, mozilla::psm::EVStatus, bool, PRErrorCode, uint32_t)':
[task 2020-03-05T11:00:26.237Z] 11:00:26 ERROR - /builds/worker/workspace/build/src/security/manager/ssl/VerifySSLServerCertParent.cpp:85:12: error: unused variable 'nrv' [-Werror=unused-variable]
[task 2020-03-05T11:00:26.237Z] 11:00:26 INFO - nsresult nrv = mTarget->Dispatch(
[task 2020-03-05T11:00:26.237Z] 11:00:26 INFO - ^~~
[task 2020-03-05T11:00:26.237Z] 11:00:26 INFO - cc1plus: all warnings being treated as errors
[task 2020-03-05T11:00:26.237Z] 11:00:26 INFO - /builds/worker/workspace/build/src/config/rules.mk:745: recipe for target 'Unified_cpp_security_manager_ssl1.o' failed
[task 2020-03-05T11:00:26.237Z] 11:00:26 ERROR - make[4]: *** [Unified_cpp_security_manager_ssl1.o] Error 1
[task 2020-03-05T11:00:26.237Z] 11:00:26 INFO - make[4]: Leaving directory '/builds/worker/workspace/build/src/obj-firefox/security/manager/ssl'
[task 2020-03-05T11:00:26.237Z] 11:00:26 INFO - /builds/worker/workspace/build/src/config/recurse.mk:74: recipe for target 'security/manager/ssl/target-objects' failed
[task 2020-03-05T11:00:26.237Z] 11:00:26 ERROR - make[3]: *** [security/manager/ssl/target-objects] Error 2
[task 2020-03-05T11:00:26.237Z] 11:00:26 INFO - make[3]: *** Waiting for unfinished jobs....
[task 2020-03-05T11:00:26.697Z] 11:00:26 INFO - make[4]: Entering directory '/builds/worker/workspace/build/src/obj-firefox/toolkit/components/fuzzyfox'
[task 2020-03-05T11:00:26.697Z] 11:00:26 INFO - /builds/worker/fetches/sccache/sccache /builds/worker/fetches/gcc/bin/g++ -std=gnu++17 -o Fuzzyfox.o -c -I/builds/worker/workspace/build/src/obj-firefox/dist/stl_wrappers -I/builds/worker/workspace/build/src/obj-firefox/dist/system_wrappers -include /builds/worker/workspace/build/src/config/gcc_hidden.h -U_FORTIFY_SOURCE -D_FORTIFY_SOURCE=2 -fstack-protector-strong -DNDEBUG=1 -DTRIMMED=1 -DMOZ_HAS_MOZGLUE -DMOZILLA_INTERNAL_API -DIMPL_LIBXUL -DSTATIC_EXPORTABLE_JS_API -I/builds/worker/workspace/build/src/toolkit/components/fuzzyfox -I/builds/worker/workspace/build/src/obj-firefox/toolkit/components/fuzzyfox -I/builds/worker/workspace/build/src/obj-firefox/dist/include -I/builds/worker/workspace/build/src/obj-firefox/dist/include/nspr -I/builds/worker/workspace/build/src/obj-firefox/dist/include/nss -fPIC -DMOZILLA_CLIENT -include /builds/worker/workspace/build/src/obj-firefox/mozilla-config.h -Wall -Wempty-body -Wignored-qualifiers -Woverloaded-virtual -Wpointer-arith -Wsign-compare -Wtype-limits -Wunreachable-code -Wwrite-strings -Wno-invalid-offsetof -Wduplicated-cond -Wimplicit-fallthrough -Wunused-function -Wunused-variable -Wno-error=maybe-uninitialized -Wno-error=deprecated-declarations -Wno-error=array-bounds -Wno-error=coverage-mismatch -Wno-error=free-nonheap-object -Wformat -Wformat-overflow=2 -D_GLIBCXX_USE_CXX11_ABI=0 -fno-sized-deallocation -fno-aligned-new -fno-exceptions -fno-strict-aliasing -fno-rtti -ffunction-sections -fdata-sections -fno-exceptions -fno-math-errno -pthread -pipe -g -freorder-blocks -O2 -fno-omit-frame-pointer -funwind-tables -Werror -MD -MP -MF .deps/Fuzzyfox.o.pp /builds/worker/workspace/build/src/toolkit/components/fuzzyfox/Fuzzyfox.cpp
[task 2020-03-05T11:00:26.697Z] 11:00:26 INFO - make[4]: Leaving directory '/builds/worker/workspace/build/src/obj-firefox/toolkit/components/fuzzyfox'
[task 2020-03-05T11:00:27.389Z] 11:00:27 INFO - make[4]: Entering directory '/builds/worker/workspace/build/src/obj-firefox/toolkit/components/clearsitedata'
[task 2020-03-05T11:00:27.389Z] 11:00:27 INFO - /builds/worker/fetches/sccache/sccache /builds/worker/fetches/gcc/bin/g++ -std=gnu++17 -o Unified_cpp_clearsitedata0.o -c -I/builds/worker/workspace/build/src/obj-firefox/dist/stl_wrappers -I/builds/worker/workspace/build/src/obj-firefox/dist/system_wrappers -include /builds/worker/workspace/build/src/config/gcc_hidden.h -U_FORTIFY_SOURCE -D_FORTIFY_SOURCE=2 -fstack-protector-strong -DNDEBUG=1 -DTRIMMED=1 -DOS_POSIX=1 -DOS_LINUX=1 -DMOZ_HAS_MOZGLUE -DMOZILLA_INTERNAL_API -DIMPL_LIBXUL -DSTATIC_EXPORTABLE_JS_API -I/builds/worker/workspace/build/src/toolkit/components/clearsitedata -I/builds/worker/workspace/build/src/obj-firefox/toolkit/components/clearsitedata -I/builds/worker/workspace/build/src/netwerk/base -I/builds/worker/workspace/build/src/netwerk/protocol/http -I/builds/worker/workspace/build/src/obj-firefox/ipc/ipdl/_ipdlheaders -I/builds/worker/workspace/build/src/ipc/chromium/src -I/builds/worker/workspace/build/src/ipc/glue -I/builds/worker/workspace/build/src/obj-firefox/dist/include -I/builds/worker/workspace/build/src/obj-firefox/dist/include/nspr -I/builds/worker/workspace/build/src/obj-firefox/dist/include/nss -fPIC -DMOZILLA_CLIENT -include /builds/worker/workspace/build/src/obj-firefox/mozilla-config.h -Wall -Wempty-body -Wignored-qualifiers -Woverloaded-virtual -Wpointer-arith -Wsign-compare -Wtype-limits -Wunreachable-code -Wwrite-strings -Wno-invalid-offsetof -Wduplicated-cond -Wimplicit-fallthrough -Wunused-function -Wunused-variable -Wno-error=maybe-uninitialized -Wno-error=deprecated-declarations -Wno-error=array-bounds -Wno-error=coverage-mismatch -Wno-error=free-nonheap-object -Wformat -Wformat-overflow=2 -D_GLIBCXX_USE_CXX11_ABI=0 -fno-sized-deallocation -fno-aligned-new -fno-exceptions -fno-strict-aliasing -fno-rtti -ffunction-sections -fdata-sections -fno-exceptions -fno-math-errno -pthread -pipe -g -freorder-blocks -O2 -fno-omit-frame-pointer -funwind-tables -Werror -MD -MP -MF .deps/Unified_cpp_clearsitedata0.o.pp Unified_cpp_clearsitedata0.cpp
[task 2020-03-05T11:00:27.389Z] 11:00:27 INFO - make[4]: Leaving directory '/builds/worker/workspace/build/src/obj-firefox/toolkit/components/clearsitedata'
[task 2020-03-05T11:00:27.465Z] 11:00:27 INFO - make[4]: Entering directory '/builds/worker/workspace/build/src/obj-firefox/toolkit/components/mozintl'
[task 2020-03-05T11:00:27.465Z] 11:00:27 INFO - /builds/worker/fetches/sccache/sccache /builds/worker/fetches/gcc/bin/g++ -std=gnu++17 -o MozIntlHelper.o -c -I/builds/worker/workspace/build/src/obj-firefox/dist/stl_wrappers -I/builds/worker/workspace/build/src/obj-firefox/dist/system_wrappers -include /builds/worker/workspace/build/src/config/gcc_hidden.h -U_FORTIFY_SOURCE -D_FORTIFY_SOURCE=2 -fstack-protector-strong -DNDEBUG=1 -DTRIMMED=1 -DMOZ_HAS_MOZGLUE -DMOZILLA_INTERNAL_API -DIMPL_LIBXUL -DSTATIC_EXPORTABLE_JS_API -I/builds/worker/workspace/build/src/toolkit/components/mozintl -I/builds/worker/workspace/build/src/obj-firefox/toolkit/components/mozintl -I/builds/worker/workspace/build/src/obj-firefox/dist/include -I/builds/worker/workspace/build/src/obj-firefox/dist/include/nspr -I/builds/worker/workspace/build/src/obj-firefox/dist/include/nss -fPIC -DMOZILLA_CLIENT -include /builds/worker/workspace/build/src/obj-firefox/mozilla-config.h -Wall -Wempty-body -Wignored-qualifiers -Woverloaded-virtual -Wpointer-arith -Wsign-compare -Wtype-limits -Wunreachable-code -Wwrite-strings -Wno-invalid-offsetof -Wduplicated-cond -Wimplicit-fallthrough -Wunused-function -Wunused-variable -Wno-error=maybe-uninitialized -Wno-error=deprecated-declarations -Wno-error=array-bounds -Wno-error=coverage-mismatch -Wno-error=free-nonheap-object -Wformat -Wformat-overflow=2 -D_GLIBCXX_USE_CXX11_ABI=0 -fno-sized-deallocation -fno-aligned-new -fno-exceptions -fno-strict-aliasing -fno-rtti -ffunction-sections -fdata-sections -fno-exceptions -fno-math-errno -pthread -pipe -g -freorder-blocks -O2 -fno-omit-frame-pointer -funwind-tables -Werror -MD -MP -MF .deps/MozIntlHelper.o.pp /builds/worker/workspace/build/src/toolkit/components/mozintl/MozIntlHelper.cpp
[task 2020-03-05T11:00:27.466Z] 11:00:27 INFO - make[4]: Leaving directory '/builds/worker/workspace/build/src/obj-firefox/toolkit/components/mozintl'
[task 2020-03-05T11:00:27.969Z] 11:00:27 INFO - make[4]: Entering directory '/builds/worker/workspace/build/src/obj-firefox/toolkit/components/browser'
[task 2020-03-05T11:00:27.970Z] 11:00:27 INFO - /builds/worker/fetches/sccache/sccache /builds/worker/fetches/gcc/bin/g++ -std=gnu++17 -o Unified_cpp_components_browser0.o -c -I/builds/worker/workspace/build/src/obj-firefox/dist/stl_wrappers -I/builds/worker/workspace/build/src/obj-firefox/dist/system_wrappers -include /builds/worker/workspace/build/src/config/gcc_hidden.h -U_FORTIFY_SOURCE -D_FORTIFY_SOURCE=2 -fstack-protector-strong -DNDEBUG=1 -DTRIMMED=1 -DOS_POSIX=1 -DOS_LINUX=1 -DMOZ_HAS_MOZGLUE -DMOZILLA_INTERNAL_API -DIMPL_LIBXUL -DSTATIC_EXPORTABLE_JS_API -I/builds/worker/workspace/build/src/toolkit/components/browser -I/builds/worker/workspace/build/src/obj-firefox/toolkit/components/browser -I/builds/worker/workspace/build/src/obj-firefox/ipc/ipdl/_ipdlheaders -I/builds/worker/workspace/build/src/ipc/chromium/src -I/builds/worker/workspace/build/src/ipc/glue -I/builds/worker/workspace/build/src/docshell/base -I/builds/worker/workspace/build/src/dom/base -I/builds/worker/workspace/build/src/dom/svg -I/builds/worker/workspace/build/src/layout/style -I/builds/worker/workspace/build/src/obj-firefox/dist/include -I/builds/worker/workspace/build/src/obj-firefox/dist/include/nspr -I/builds/worker/workspace/build/src/obj-firefox/dist/include/nss -fPIC -DMOZILLA_CLIENT -include /builds/worker/workspace/build/src/obj-firefox/mozilla-config.h -Wall -Wempty-body -Wignored-qualifiers -Woverloaded-virtual -Wpointer-arith -Wsign-compare -Wtype-limits -Wunreachable-code -Wwrite-strings -Wno-invalid-offsetof -Wduplicated-cond -Wimplicit-fallthrough -Wunused-function -Wunused-variable -Wno-error=maybe-uninitialized -Wno-error=deprecated-declarations -Wno-error=array-bounds -Wno-error=coverage-mismatch -Wno-error=free-nonheap-object -Wformat -Wformat-overflow=2 -D_GLIBCXX_USE_CXX11_ABI=0 -fno-sized-deallocation -fno-aligned-new -fno-exceptions -fno-strict-aliasing -fno-rtti -ffunction-sections -fdata-sections -fno-exceptions -fno-math-errno -pthread -pipe -g -freorder-blocks -O2 -fno-omit-frame-pointer -funwind-tables -Werror -Wno-error=shadow -MD -MP -MF .deps/Unified_cpp_components_browser0.o.pp Unified_cpp_components_browser0.cpp
[task 2020-03-05T11:00:27.971Z] 11:00:27 INFO - make[4]: Leaving directory '/builds/worker/workspace/build/src/obj-firefox/toolkit/components/browser'
[task 2020-03-05T11:00:28.380Z] 11:00:28 INFO - make[4]: Entering directory '/builds/worker/workspace/build/src/obj-firefox/toolkit/components/mediasniffer'

Assignee: nobody → kershaw

This bug is tracked by a release manager but with a small severity so change it to major.
For more information, please visit auto_nag documentation.

Severity: normal → major
Status: NEW → RESOLVED
Closed: 2 years ago
Resolution: --- → FIXED
Target Milestone: --- → mozilla75

Please specify a root cause for this bug. See :tmaity for more information.

Root Cause: --- → ?
Root Cause: ? → Coding: Syntax Error
You need to log in before you can comment on or make changes to this bug.