Closed Bug 1634916 Opened 3 months ago Closed 3 months ago

Intermittent autowinchecksec.py | Winchecksec returned error code -11:

Categories

(Firefox Build System :: General, defect, P5)

defect

Tracking

(firefox76 unaffected, firefox77 unaffected, firefox78 fixed)

RESOLVED FIXED
mozilla78
Tracking Status
firefox76 --- unaffected
firefox77 --- unaffected
firefox78 --- fixed

People

(Reporter: intermittent-bug-filer, Assigned: glandium)

References

(Regression)

Details

(Keywords: intermittent-failure)

Filed by: shindli [at] mozilla.com
Parsed log: https://treeherder.mozilla.org/logviewer.html#?job_id=300521180&repo=mozilla-central
Full log: https://firefox-ci-tc.services.mozilla.com/api/queue/v1/task/KqY7Xfm6QPuvpOdCv4bYoA/runs/0/artifacts/public/logs/live_backing.log


[task 2020-05-02T22:54:20.526Z] 22:54:20 INFO - Finished processing z:\build\workspace\obj-build\build\win32\crashinjectdll\crashinjectdll.dll in 0.67s
[task 2020-05-02T22:54:20.526Z] 22:54:20 INFO - mozmake.EXE[4]: Leaving directory 'z:/build/workspace/obj-build/build/win32/crashinjectdll'
[task 2020-05-02T22:54:20.869Z] 22:54:20 INFO - mozmake.EXE[4]: Entering directory 'z:/build/workspace/obj-build/mfbt/tests'
[task 2020-05-02T22:54:20.869Z] 22:54:20 INFO - z:/build/workspace/obj-build/_virtualenvs/init_py3/Scripts/python.exe z:/build/build/src/config/nsinstall.py -t -m 755 'TestRange.exe' '../../dist/bin'
[task 2020-05-02T22:54:20.869Z] 22:54:20 INFO - mozmake.EXE[4]: Leaving directory 'z:/build/workspace/obj-build/mfbt/tests'
[task 2020-05-02T22:54:21.274Z] 22:54:21 INFO - mozmake.EXE[4]: *** Deleting file 'crashinjectdll.dll_syms.track'
[task 2020-05-02T22:54:21.276Z] 22:54:21 INFO - mozmake.EXE[4]: Entering directory 'z:/build/workspace/obj-build/build/win32/crashinjectdll'
[task 2020-05-02T22:54:21.277Z] 22:54:21 INFO - z:/build/workspace/obj-build/_virtualenvs/init_py3/Scripts/python.exe z:/build/build/src/build/win32/autowinchecksec.py crashinjectdll.dll
[task 2020-05-02T22:54:21.278Z] 22:54:21 ERROR - Traceback (most recent call last):
[task 2020-05-02T22:54:21.278Z] 22:54:21 INFO - File "z:/build/build/src/build/win32/autowinchecksec.py", line 39, in <module>
[task 2020-05-02T22:54:21.278Z] 22:54:21 INFO - universal_newlines=True)
[task 2020-05-02T22:54:21.278Z] 22:54:21 INFO - File "c:\mozilla-build\python3\Lib\subprocess.py", line 336, in check_output
[task 2020-05-02T22:54:21.278Z] 22:54:21 INFO - **kwargs).stdout
[task 2020-05-02T22:54:21.279Z] 22:54:21 INFO - File "c:\mozilla-build\python3\Lib\subprocess.py", line 403, in run
[task 2020-05-02T22:54:21.279Z] 22:54:21 INFO - with Popen(*popenargs, **kwargs) as process:
[task 2020-05-02T22:54:21.279Z] 22:54:21 INFO - File "c:\mozilla-build\python3\Lib\subprocess.py", line 709, in init
[task 2020-05-02T22:54:21.279Z] 22:54:21 INFO - restore_signals, start_new_session)
[task 2020-05-02T22:54:21.279Z] 22:54:21 INFO - File "c:\mozilla-build\python3\Lib\subprocess.py", line 997, in _execute_child
[task 2020-05-02T22:54:21.280Z] 22:54:21 INFO - startupinfo)
[task 2020-05-02T22:54:21.280Z] 22:54:21 INFO - OSError: [WinError 193] %1 is not a valid Win32 application
[task 2020-05-02T22:54:21.280Z] 22:54:21 INFO - z:/build/build/src/config/rules.mk:738: recipe for target 'crashinjectdll.dll_syms.track' failed
[task 2020-05-02T22:54:21.280Z] 22:54:21 INFO - mozmake.EXE[4]: *** [crashinjectdll.dll_syms.track] Error 1
[task 2020-05-02T22:54:21.280Z] 22:54:21 INFO - mozmake.EXE[4]: Leaving directory 'z:/build/workspace/obj-build/build/win32/crashinjectdll'
[task 2020-05-02T22:54:21.281Z] 22:54:21 INFO - z:/build/build/src/config/recurse.mk:74: recipe for target 'build/win32/crashinjectdll/syms' failed
[task 2020-05-02T22:54:21.281Z] 22:54:21 INFO - mozmake.EXE[3]: *** [build/win32/crashinjectdll/syms] Error 2
[task 2020-05-02T22:54:21.281Z] 22:54:21 INFO - mozmake.EXE[3]: *** Waiting for unfinished jobs....
[task 2020-05-02T22:54:21.327Z] 22:54:21 INFO - mozmake.EXE[4]: Entering directory 'z:/build/workspace/obj-build/mfbt/tests'
[task 2020-05-02T22:54:21.327Z] 22:54:21 INFO - z:/build/workspace/obj-build/_virtualenvs/init_py3/Scripts/python.exe z:/build/build/src/config/nsinstall.py -t -m 755 'TestRefPtr.exe' '../../dist/bin'
[task 2020-05-02T22:54:21.327Z] 22:54:21 INFO - mozmake.EXE[4]: Leaving directory 'z:/build/workspace/obj-build/mfbt/tests'
[task 2020-05-02T22:54:21.981Z] 22:54:21 INFO - mozmake.EXE[4]: Entering directory 'z:/build/workspace/obj-build/mfbt/tests'

[task 2020-05-02T22:54:20.526Z] 22:54:20 INFO - Finished processing z:\build\workspace\obj-build\build\win32\crashinjectdll\crashinjectdll.dll in 0.67s
[task 2020-05-02T22:54:20.526Z] 22:54:20 INFO - mozmake.EXE[4]: Leaving directory 'z:/build/workspace/obj-build/build/win32/crashinjectdll'
[task 2020-05-02T22:54:20.869Z] 22:54:20 INFO - mozmake.EXE[4]: Entering directory 'z:/build/workspace/obj-build/mfbt/tests'
[task 2020-05-02T22:54:20.869Z] 22:54:20 INFO - z:/build/workspace/obj-build/_virtualenvs/init_py3/Scripts/python.exe z:/build/build/src/config/nsinstall.py -t -m 755 'TestRange.exe' '../../dist/bin'
[task 2020-05-02T22:54:20.869Z] 22:54:20 INFO - mozmake.EXE[4]: Leaving directory 'z:/build/workspace/obj-build/mfbt/tests'
[task 2020-05-02T22:54:21.274Z] 22:54:21 INFO - mozmake.EXE[4]: *** Deleting file 'crashinjectdll.dll_syms.track'
[task 2020-05-02T22:54:21.276Z] 22:54:21 INFO - mozmake.EXE[4]: Entering directory 'z:/build/workspace/obj-build/build/win32/crashinjectdll'
[task 2020-05-02T22:54:21.277Z] 22:54:21 INFO - z:/build/workspace/obj-build/_virtualenvs/init_py3/Scripts/python.exe z:/build/build/src/build/win32/autowinchecksec.py crashinjectdll.dll
[task 2020-05-02T22:54:21.278Z] 22:54:21 ERROR - Traceback (most recent call last):
[task 2020-05-02T22:54:21.278Z] 22:54:21 INFO - File "z:/build/build/src/build/win32/autowinchecksec.py", line 39, in <module>
[task 2020-05-02T22:54:21.278Z] 22:54:21 INFO - universal_newlines=True)
[task 2020-05-02T22:54:21.278Z] 22:54:21 INFO - File "c:\mozilla-build\python3\Lib\subprocess.py", line 336, in check_output
[task 2020-05-02T22:54:21.278Z] 22:54:21 INFO - **kwargs).stdout
[task 2020-05-02T22:54:21.279Z] 22:54:21 INFO - File "c:\mozilla-build\python3\Lib\subprocess.py", line 403, in run
[task 2020-05-02T22:54:21.279Z] 22:54:21 INFO - with Popen(*popenargs, **kwargs) as process:
[task 2020-05-02T22:54:21.279Z] 22:54:21 INFO - File "c:\mozilla-build\python3\Lib\subprocess.py", line 709, in init
[task 2020-05-02T22:54:21.279Z] 22:54:21 INFO - restore_signals, start_new_session)
[task 2020-05-02T22:54:21.279Z] 22:54:21 INFO - File "c:\mozilla-build\python3\Lib\subprocess.py", line 997, in _execute_child
[task 2020-05-02T22:54:21.280Z] 22:54:21 INFO - startupinfo)
[task 2020-05-02T22:54:21.280Z] 22:54:21 INFO - OSError: [WinError 193] %1 is not a valid Win32 application
[task 2020-05-02T22:54:21.280Z] 22:54:21 INFO - z:/build/build/src/config/rules.mk:738: recipe for target 'crashinjectdll.dll_syms.track' failed
[task 2020-05-02T22:54:21.280Z] 22:54:21 INFO - mozmake.EXE[4]: *** [crashinjectdll.dll_syms.track] Error 1
[task 2020-05-02T22:54:21.280Z] 22:54:21 INFO - mozmake.EXE[4]: Leaving directory 'z:/build/workspace/obj-build/build/win32/crashinjectdll'
[task 2020-05-02T22:54:21.281Z] 22:54:21 INFO - z:/build/build/src/config/recurse.mk:74: recipe for target 'build/win32/crashinjectdll/syms' failed
[task 2020-05-02T22:54:21.281Z] 22:54:21 INFO - mozmake.EXE[3]: *** [build/win32/crashinjectdll/syms] Error 2
[task 2020-05-02T22:54:21.281Z] 22:54:21 INFO - mozmake.EXE[3]: *** Waiting for unfinished jobs....

[task 2020-05-02T22:54:25.215Z] 22:54:25 INFO - mozmake.EXE[4]: Leaving directory 'z:/build/workspace/obj-build/mfbt/tests'
[task 2020-05-02T22:54:25.401Z] 22:54:25 INFO - mozmake.EXE[4]: Entering directory 'z:/build/workspace/obj-build/mfbt/tests'
[task 2020-05-02T22:54:25.401Z] 22:54:25 INFO - z:/build/workspace/obj-build/_virtualenvs/init_py3/Scripts/python.exe z:/build/build/src/config/nsinstall.py -t -m 755 'TestTemplateLib.exe' '../../dist/bin'
[task 2020-05-02T22:54:25.401Z] 22:54:25 INFO - mozmake.EXE[4]: Leaving directory 'z:/build/workspace/obj-build/mfbt/tests'
[task 2020-05-02T22:54:25.967Z] 22:54:25 INFO - mozmake.EXE[4]: *** Deleting file 'crashinject.exe_syms.track'
[task 2020-05-02T22:54:25.968Z] 22:54:25 INFO - mozmake.EXE[4]: Entering directory 'z:/build/workspace/obj-build/build/win32'
[task 2020-05-02T22:54:25.969Z] 22:54:25 INFO - z:/build/workspace/obj-build/_virtualenvs/init_py3/Scripts/python.exe z:/build/build/src/build/win32/autowinchecksec.py ../../dist/bin/crashinject.exe
[task 2020-05-02T22:54:25.970Z] 22:54:25 ERROR - Traceback (most recent call last):
[task 2020-05-02T22:54:25.972Z] 22:54:25 INFO - File "z:/build/build/src/build/win32/autowinchecksec.py", line 39, in <module>
[task 2020-05-02T22:54:25.972Z] 22:54:25 INFO - universal_newlines=True)
[task 2020-05-02T22:54:25.972Z] 22:54:25 INFO - File "c:\mozilla-build\python3\Lib\subprocess.py", line 336, in check_output
[task 2020-05-02T22:54:25.972Z] 22:54:25 INFO - **kwargs).stdout
[task 2020-05-02T22:54:25.972Z] 22:54:25 INFO - File "c:\mozilla-build\python3\Lib\subprocess.py", line 403, in run
[task 2020-05-02T22:54:25.972Z] 22:54:25 INFO - with Popen(*popenargs, **kwargs) as process:
[task 2020-05-02T22:54:25.973Z] 22:54:25 INFO - File "c:\mozilla-build\python3\Lib\subprocess.py", line 709, in init
[task 2020-05-02T22:54:25.973Z] 22:54:25 INFO - restore_signals, start_new_session)
[task 2020-05-02T22:54:25.973Z] 22:54:25 INFO - File "c:\mozilla-build\python3\Lib\subprocess.py", line 997, in _execute_child
[task 2020-05-02T22:54:25.973Z] 22:54:25 INFO - startupinfo)
[task 2020-05-02T22:54:25.973Z] 22:54:25 INFO - OSError: [WinError 193] %1 is not a valid Win32 application
[task 2020-05-02T22:54:25.973Z] 22:54:25 INFO - z:/build/build/src/config/rules.mk:738: recipe for target 'crashinject.exe_syms.track' failed
[task 2020-05-02T22:54:25.973Z] 22:54:25 INFO - mozmake.EXE[4]: *** [crashinject.exe_syms.track] Error 1
[task 2020-05-02T22:54:25.975Z] 22:54:25 INFO - mozmake.EXE[4]: Leaving directory 'z:/build/workspace/obj-build/build/win32'
[task 2020-05-02T22:54:25.975Z] 22:54:25 INFO - z:/build/build/src/config/recurse.mk:74: recipe for target 'build/win32/syms' failed
[task 2020-05-02T22:54:25.975Z] 22:54:25 INFO - mozmake.EXE[3]: *** [build/win32/syms] Error 2
[task 2020-05-02T22:54:26.729Z] 22:54:26 INFO - mozmake.EXE[4]: Entering directory 'z:/build/workspace/obj-build/mfbt/tests'
[task 2020-05-02T22:54:26.729Z] 22:54:26 INFO - z:/build/workspace/obj-build/_virtualenvs/init_py3/Scripts/python.exe z:/build/build/src/config/nsinstall.py -t -m 755 'TestTextUtils.exe' '../../dist/bin'
[task 2020-05-02T22:54:26.729Z] 22:54:26 INFO - mozmake.EXE[4]: Leaving directory 'z:/build/workspace/obj-build/mfbt/tests'
[task 2020-05-02T22:54:26.860Z] 22:54:26 INFO - mozmake.EXE[4]: Entering directory 'z:/build/workspace/obj-build/mfbt/tests'
[task 2020-05-02T22:54:26.860Z] 22:54:26 INFO - z:/build/workspace/obj-build/_virtualenvs/init_py3/Scripts/python.exe z:/build/build/src/config/nsinstall.py -t -m 755 'TestThreadSafeWeakPtr.exe' '../../dist/bin'
[task 2020-05-02T22:54:26.860Z] 22:54:26 INFO - mozmake.EXE[4]: Leaving directory 'z:/build/workspace/obj-build/mfbt/tests'
[task 2020-05-02T22:54:27.232Z] 22:54:27 INFO - mozmake.EXE[4]: *** Deleting file 'lgpllibs.dll_syms.track'
[task 2020-05-02T22:54:27.232Z] 22:54:27 INFO - mozmake.EXE[4]: Entering directory 'z:/build/workspace/obj-build/config/external/lgpllibs'
[task 2020-05-02T22:54:27.232Z] 22:54:27 INFO - z:/build/workspace/obj-build/_virtualenvs/init_py3/Scripts/python.exe z:/build/build/src/build/win32/autowinchecksec.py lgpllibs.dll
[task 2020-05-02T22:54:27.232Z] 22:54:27 ERROR - Traceback (most recent call last):
[task 2020-05-02T22:54:27.232Z] 22:54:27 INFO - File "z:/build/build/src/build/win32/autowinchecksec.py", line 39, in <module>
[task 2020-05-02T22:54:27.232Z] 22:54:27 INFO - universal_newlines=True)
[task 2020-05-02T22:54:27.232Z] 22:54:27 INFO - File "c:\mozilla-build\python3\Lib\subprocess.py", line 336, in check_output
[task 2020-05-02T22:54:27.233Z] 22:54:27 INFO - **kwargs).stdout

[task 2020-05-02T22:54:27.233Z] 22:54:27 INFO - File "c:\mozilla-build\python3\Lib\subprocess.py", line 709, in init
[task 2020-05-02T22:54:27.233Z] 22:54:27 INFO - restore_signals, start_new_session)
[task 2020-05-02T22:54:27.233Z] 22:54:27 INFO - File "c:\mozilla-build\python3\Lib\subprocess.py", line 997, in _execute_child
[task 2020-05-02T22:54:27.233Z] 22:54:27 INFO - startupinfo)
[task 2020-05-02T22:54:27.234Z] 22:54:27 INFO - OSError: [WinError 193] %1 is not a valid Win32 application
[task 2020-05-02T22:54:27.234Z] 22:54:27 INFO - z:/build/build/src/config/rules.mk:738: recipe for target 'lgpllibs.dll_syms.track' failed
[task 2020-05-02T22:54:27.234Z] 22:54:27 INFO - mozmake.EXE[4]: *** [lgpllibs.dll_syms.track] Error 1
[task 2020-05-02T22:54:27.234Z] 22:54:27 INFO - mozmake.EXE[4]: Leaving directory 'z:/build/workspace/obj-build/config/external/lgpllibs'
[task 2020-05-02T22:54:27.234Z] 22:54:27 INFO - z:/build/build/src/config/recurse.mk:74: recipe for target 'config/external/lgpllibs/syms' failed
[task 2020-05-02T22:54:27.234Z] 22:54:27 INFO - mozmake.EXE[3]: *** [config/external/lgpllibs/syms] Error 2
[task 2020-05-02T22:54:27.284Z] 22:54:27 INFO - mozmake.EXE[4]: Entering directory 'z:/build/workspace/obj-build/mfbt/tests'
[task 2020-05-02T22:54:27.284Z] 22:54:27 INFO - z:/build/workspace/obj-build/_virtualenvs/init_py3/Scripts/python.exe z:/build/build/src/config/nsinstall.py -t -m 755 'TestTuple.exe' '../../dist/bin'
[task 2020-05-02T22:54:27.284Z] 22:54:27 INFO - mozmake.EXE[4]: Leaving directory 'z:/build/workspace/obj-build/mfbt/tests'
[task 2020-05-02T22:54:27.717Z] 22:54:27 INFO - mozmake.EXE[4]: Entering directory 'z:/build/workspace/obj-build/dom/plugins/ipc/hangui'
[task 2020-05-02T22:54:27.717Z] 22:54:27 INFO - z:/build/workspace/obj-build/_virtualenvs/init_py3/Scripts/python.exe -m mozbuild.action.dumpsymbols z:/build/workspace/obj-build/dist/bin/plugin-hang-ui.exe z:/build/workspace/obj-build/dom/plugins/ipc/hangui/plugin-hang-ui.exe_syms.track
[task 2020-05-02T22:54:27.717Z] 22:54:27 INFO - Running: z:\build\workspace\obj-build_virtualenvs\init_py3\Scripts\python.exe z:/build/build/src\toolkit\crashreporter\tools\symbolstore.py -c --vcs-info -i --install-manifest=z:/build/workspace/obj-build_build_manifests\install\dist_include,z:/build/workspace/obj-build\dist\include -s z:/build/build/src z:/build/fetches/dump_syms/dump_syms.exe z:/build/workspace/obj-build\dist\crashreporter-symbols z:\build\workspace\obj-build\dist\bin\plugin-hang-ui.exe
[task 2020-05-02T22:54:27.717Z] 22:54:27 INFO - Beginning work for file: z:\build\workspace\obj-build\dist\bin\plugin-hang-ui.exe
[task 2020-05-02T22:54:27.718Z] 22:54:27 INFO - Processing file: z:\build\workspace\obj-build\dist\bin\plugin-hang-ui.exe
[task 2020-05-02T22:58:10.386Z] 22:58:10 INFO - 'USERNAME': 'task_1588456534',
[task 2020-05-02T22:58:10.386Z] 22:58:10 INFO - 'USERPROFILE': 'C:\Users\task_1588456534',
[task 2020-05-02T22:58:10.386Z] 22:58:10 INFO - 'USE_SCCACHE': '1',
[task 2020-05-02T22:58:10.386Z] 22:58:10 INFO - 'WINDIR': 'C:\Windows',
[task 2020-05-02T22:58:10.386Z] 22:58:10 INFO - 'WORKSPACE': 'z:\build',
[task 2020-05-02T22:58:10.386Z] 22:58:10 INFO - 'XPCOM_DEBUG_BREAK': 'stack-and-abort'}
[task 2020-05-02T22:58:12.075Z] 22:58:12 INFO - Return code: 0
[task 2020-05-02T22:58:12.075Z] 22:58:12 INFO - Running post-run listener: _shutdown_sccache
[task 2020-05-02T22:58:12.075Z] 22:58:12 INFO - Running command: ['z:/build/fetches\sccache\sccache.exe', '--stop-server'] in z:/build/build/src
[task 2020-05-02T22:58:12.075Z] 22:58:12 INFO - Copy/paste: z:/build/fetches\sccache\sccache.exe --stop-server
[task 2020-05-02T22:58:12.082Z] 22:58:12 INFO - Stopping sccache server...
[task 2020-05-02T22:58:13.082Z] 22:58:13 INFO - error: couldn't connect to server
[task 2020-05-02T22:58:13.082Z] 22:58:13 INFO - caused by: No connection could be made because the target machine actively refused it. (os error 10061)
[task 2020-05-02T22:58:13.084Z] 22:58:13 ERROR - Return code: 2
[task 2020-05-02T22:58:13.084Z] 22:58:13 INFO - Running post-run listener: _summarize
[task 2020-05-02T22:58:13.084Z] 22:58:13 ERROR - # TBPL FAILURE #
[task 2020-05-02T22:58:13.084Z] 22:58:13 INFO - [mozharness: 2020-05-02 22:58:13.084000Z] FxDesktopBuild summary:
[task 2020-05-02T22:58:13.084Z] 22:58:13 ERROR - # TBPL FAILURE #
[fetches 2020-05-02T22:58:13.096Z] removing z:/build/fetches
[fetches 2020-05-02T22:58:14.624Z] finished
[taskcluster 2020-05-02T22:58:14.648Z] Exit Code: 4294967295
[taskcluster 2020-05-02T22:58:14.648Z] User Time: 0s
[taskcluster 2020-05-02T22:58:14.648Z] Kernel Time: 0s
[taskcluster 2020-05-02T22:58:14.648Z] Wall Time: 1h0m6.5451197s
[taskcluster 2020-05-02T22:58:14.648Z] Result: FAILED
[taskcluster 2020-05-02T22:58:14.648Z] === Task Finished ===
[taskcluster 2020-05-02T22:58:14.649Z] Task Duration: 1h0m6.7391277s
[taskcluster 2020-05-02T22:58:14.815Z] Uploading artifact public/logs/localconfig.json from file logs\localconfig.json with content encoding "gzip", mime type "application/octet-stream" and expiry 2021-05-02T21:47:48.675Z
[taskcluster 2020-05-02T22:58:15.033Z] Uploading artifact public/build/sccache.log from file public\build\sccache.log with content encoding "gzip", mime type "text/plain" and expiry 2021-05-02T21:47:48.675Z
[taskcluster 2020-05-02T22:58:15.724Z] Uploading artifact public/logs/certified.log from file generic-worker\certified.log with content encoding "gzip", mime type "text/plain; charset=utf-8" and expiry 2021-05-02T21:47:48.675Z
[taskcluster 2020-05-02T22:58:16.167Z] Uploading artifact public/chain-of-trust.json from file generic-worker\chain-of-trust.json with content encoding "gzip", mime type "text/plain; charset=utf-8" and expiry 2021-05-02T21:47:48.675Z
[taskcluster 2020-05-02T22:58:16.279Z] Uploading artifact public/chain-of-trust.json.sig from file generic-worker\chain-of-trust.json.sig with content encoding "gzip", mime type "application/octet-stream" and expiry 2021-05-02T21:47:48.675Z
[taskcluster 2020-05-02T22:58:16.330Z] [mounts] Preserving cache: Moving "Z:\task_1588456534\build" to "Z:\caches\DsEvchTMRLO5BvY24sPCmQ"
[taskcluster 2020-05-02T22:58:16.891Z] [mounts] Denying task_1588456534 access to 'Z:\caches\DsEvchTMRLO5BvY24sPCmQ'
[taskcluster 2020-05-02T22:58:32.056Z] Uploading redirect artifact public/logs/live.log to URL https://firefox-ci-tc.services.mozilla.com/api/queue/v1/task/KqY7Xfm6QPuvpOdCv4bYoA/runs/0/artifacts/public/logs/live_backing.log with mime type "text/plain; charset=utf-8" and expiry 2021-05-02T21:47:48.675Z
[taskcluster:error] exit status 4294967295

Regressed by: 1625696
Status: NEW → RESOLVED
Closed: 3 months ago
Resolution: --- → FIXED

Set release status flags based on info from the regressing bug 1625696

Assignee: nobody → mh+mozilla
Target Milestone: --- → mozilla78
You need to log in before you can comment on or make changes to this bug.