Closed Bug 1674033 Opened 1 year ago Closed 1 year ago

Perma win asan reporter bustage due to Bug 1672865 package-tests> mozmake.EXE[3]: *** [stage-package] Error 2 - Cannot open: File or path name too long

Categories

(Firefox Build System :: General, defect, P5)

defect

Tracking

(firefox-esr78 unaffected, firefox82 unaffected, firefox83 unaffected, firefox84 fixed)

RESOLVED FIXED
84 Branch
Tracking Status
firefox-esr78 --- unaffected
firefox82 --- unaffected
firefox83 --- unaffected
firefox84 --- fixed

People

(Reporter: intermittent-bug-filer, Assigned: CosminS)

References

(Regression)

Details

(Keywords: intermittent-failure, regression)

Attachments

(1 file)

Filed by: csabou [at] mozilla.com
Parsed log: https://treeherder.mozilla.org/logviewer.html#?job_id=320076845&repo=mozilla-central
Full log: https://firefox-ci-tc.services.mozilla.com/api/queue/v1/task/RE4GEqsTQ5OCVQmbUpF8eg/runs/2/artifacts/public/logs/live_backing.log


[task 2020-10-29T00:43:58.333Z] 00:43:58     INFO -  package-tests> Downloading wpt manifest
[task 2020-10-29T00:43:58.333Z] 00:43:58     INFO -  package-tests>  0:00.13 INFO Creating config file z:/task_1603925740/workspace/obj-build\_tests\web-platform\wptrunner.local.ini
[task 2020-10-29T00:43:58.333Z] 00:43:58     INFO -  package-tests>  0:00.14 INFO Creating directory z:\task_1603925740\workspace\obj-build\_tests\web-platform\meta
[task 2020-10-29T00:43:58.333Z] 00:43:58     INFO -  package-tests>  0:00.14 INFO Creating directory z:\task_1603925740\workspace\obj-build\_tests\web-platform\mozilla\meta
[task 2020-10-29T00:43:58.333Z] 00:43:58     INFO -  package-tests>  0:02.67 INFO Downloading manifest from https://firefox-ci-tc.services.mozilla.com/api/index/v1/task/gecko.v2.mozilla-central.revision.9b78e4ae32ae9fe7a22b4bb15efb51251d70c5e6.source.manifest-upload/artifacts/public/manifests.tar.gz
[task 2020-10-29T00:43:58.333Z] 00:43:58     INFO -  package-tests> mozmake.EXE[2]: Leaving directory 'z:/task_1603925740/workspace/obj-build'
[task 2020-10-29T00:43:59.934Z] 00:43:59     INFO -  package-tests> mozmake.EXE[3]: Entering directory 'z:/task_1603925740/workspace/obj-build/js/src/tests'
[task 2020-10-29T00:43:59.934Z] 00:43:59     INFO -  package-tests> z:/task_1603925740/workspace/obj-build/_virtualenvs/init_py3/Scripts/python.exe Z:/task_1603925740/build/src/config/nsinstall.py -D ../../../dist/test-stage/jsreftest/tests/js/src/tests
[task 2020-10-29T00:43:59.934Z] 00:43:59     INFO -  package-tests> (cd Z:/task_1603925740/build/src/js/src/tests && tar -chf - jsreftest.html shell.js browser.js js-test-driver-end.js user.js non262/ shell/ test/ test262/ ) | (cd ../../../dist/test-stage/jsreftest/tests/js/src/tests && tar -xf -)
[task 2020-10-29T00:43:59.934Z] 00:43:59     INFO -  package-tests> tar: test262/built-ins/Object/seal/object-seal-the-configurable-attribute-of-all-own-properties-of-o-are-set-from-true-to-false-and-other-attributes-of-the-property-are-unaltered.js: Cannot open: File or path name too long
[task 2020-10-29T00:43:59.934Z] 00:43:59     INFO -  package-tests> tar: test262/built-ins/Object/seal/object-seal-the-configurable-attribute-of-own-accessor-property-of-o-is-set-from-true-to-false-and-other-attributes-of-the-property-are-unaltered.js: Cannot open: File or path name too long
[task 2020-10-29T00:43:59.934Z] 00:43:59     INFO -  package-tests> tar: Exiting with failure status due to previous errors
[task 2020-10-29T00:43:59.934Z] 00:43:59     INFO -  package-tests> Makefile:33: recipe for target 'stage-package' failed
[task 2020-10-29T00:43:59.934Z] 00:43:59     INFO -  package-tests> mozmake.EXE[3]: *** [stage-package] Error 2
[task 2020-10-29T00:43:59.934Z] 00:43:59     INFO -  package-tests> mozmake.EXE[3]: Leaving directory 'z:/task_1603925740/workspace/obj-build/js/src/tests'
[task 2020-10-29T00:43:59.934Z] 00:43:59     INFO -  package-tests> Z:/task_1603925740/build/src/testing/testsuite-targets.mk:193: recipe for target 'stage-jstests' failed
[task 2020-10-29T00:43:59.934Z] 00:43:59     INFO -  package-tests> mozmake.EXE[2]: *** [stage-jstests] Error 2
[task 2020-10-29T00:43:59.943Z] 00:43:59     INFO -  Z:/task_1603925740/build/src/build/moz-automation.mk:110: recipe for target 'automation/package-tests' failed
[task 2020-10-29T00:43:59.943Z] 00:43:59     INFO -  mozmake.EXE[1]: *** [automation/package-tests] Error 2
[task 2020-10-29T00:43:59.943Z] 00:43:59     INFO -  mozmake.EXE[1]: *** Waiting for unfinished jobs....```
Assignee: nobody → csabou
Status: NEW → ASSIGNED
Attachment #9184435 - Attachment description: Bug 1674033 - Remove file in order to unbust win asan reporter. r=jwalden → Bug 1674033 - Remove files in order to unbust win asan reporter. r=jwalden
Pushed by csabou@mozilla.com:
https://hg.mozilla.org/integration/autoland/rev/ff7124e703ef
Remove files in order to unbust win asan reporter. r=jwalden
Pushed by csabou@mozilla.com:
https://hg.mozilla.org/mozilla-central/rev/d54d820d6a8d
Remove files in order to unbust win asan reporter. r=jwalden
Status: ASSIGNED → RESOLVED
Closed: 1 year ago
Resolution: --- → FIXED
Target Milestone: --- → 84 Branch

Set release status flags based on info from the regressing bug 1672865

You need to log in before you can comment on or make changes to this bug.