Closed Bug 1730954 Opened 5 years ago Closed 5 years ago

Intermittent gmake[4]: *** [/builds/worker/checkouts/gecko/config/makefiles/rust.mk:404: force-cargo-library-build] Error 101 after error: could not compile `gkrust`

Categories

(Firefox Build System :: General, defect, P5)

defect

Tracking

(Not tracked)

RESOLVED DUPLICATE of bug 1710972

People

(Reporter: intermittent-bug-filer, Unassigned)

Details

(Keywords: intermittent-failure)

Filed by: ncsoregi [at] mozilla.com
Parsed log: https://treeherder.mozilla.org/logviewer?job_id=351644146&repo=autoland
Full log: https://firefox-ci-tc.services.mozilla.com/api/queue/v1/task/KoPQNeOYSAysqfu8UwPBog/runs/0/artifacts/public/logs/live_backing.log


[task 2021-09-15T16:24:55.128Z] 16:24:55     INFO -     Compiling gkrust v0.1.0 (/builds/worker/checkouts/gecko/toolkit/library/rust)
[task 2021-09-15T16:24:55.130Z] 16:24:55     INFO -       Running `CARGO=/builds/worker/fetches/rustc/bin/cargo CARGO_CRATE_NAME=gkrust CARGO_MANIFEST_DIR=/builds/worker/checkouts/gecko/toolkit/library/rust CARGO_PKG_AUTHORS='nobody@mozilla.org' CARGO_PKG_DESCRIPTION='Rust code for libxul' CARGO_PKG_HOMEPAGE='' CARGO_PKG_LICENSE=MPL-2.0 CARGO_PKG_LICENSE_FILE='' CARGO_PKG_NAME=gkrust CARGO_PKG_REPOSITORY='' CARGO_PKG_VERSION=0.1.0 CARGO_PKG_VERSION_MAJOR=0 CARGO_PKG_VERSION_MINOR=1 CARGO_PKG_VERSION_PATCH=0 CARGO_PKG_VERSION_PRE='' CARGO_PRIMARY_PACKAGE=1 LD_LIBRARY_PATH='/builds/worker/workspace/obj-build/release/deps:/builds/worker/fetches/rustc/lib' /builds/worker/fetches/sccache/sccache /builds/worker/fetches/rustc/bin/rustc --crate-name gkrust toolkit/library/rust/lib.rs --error-format=json --json=diagnostic-rendered-ansi --crate-type staticlib --emit=dep-info,link -C panic=abort -C embed-bitcode=no -Clto -C debug-assertions=off --cfg 'feature="cubeb-remoting"' --cfg 'feature="cubeb_pulse_rust"' --cfg 'feature="gecko_profiler"' --cfg 'feature="gecko_profiler_parse_elf"' --cfg 'feature="glean_disable_upload"' --cfg 'feature="glean_with_gecko"' --cfg 'feature="libfuzzer"' --cfg 'feature="moz_places"' --cfg 'feature="new_xulstore"' --cfg 'feature="simd-accel"' --cfg 'feature="webrtc"' --cfg 'feature="with_dbus"' -C metadata=e04d1b855a2006ef -C extra-filename=-e04d1b855a2006ef --out-dir /builds/worker/workspace/obj-build/x86_64-unknown-linux-gnu/release/deps --target x86_64-unknown-linux-gnu -C linker=/builds/worker/checkouts/gecko/build/cargo-linker -L dependency=/builds/worker/workspace/obj-build/x86_64-unknown-linux-gnu/release/deps -L dependency=/builds/worker/workspace/obj-build/release/deps --extern gkrust_shared=/builds/worker/workspace/obj-build/x86_64-unknown-linux-gnu/release/deps/libgkrust_shared-0008d20980ee8f42.rlib --extern mozglue_static=/builds/worker/workspace/obj-build/x86_64-unknown-linux-gnu/release/deps/libmozglue_static-e563e730029a9aa6.rlib --extern mozilla_central_workspace_hack=/builds/worker/workspace/obj-build/x86_64-unknown-linux-gnu/release/deps/libmozilla_central_workspace_hack-2e29aee84f6d23c3.rlib --extern swgl=/builds/worker/workspace/obj-build/x86_64-unknown-linux-gnu/release/deps/libswgl-ca8196ff7fdb1c2e.rlib -C debug-assertions=no -C debuginfo=2 -C force-frame-pointers=yes -Dwarnings -Aproc-macro-back-compat -Cpasses=sancov -Cllvm-args=-sanitizer-coverage-inline-8bit-counters -Cllvm-args=-sanitizer-coverage-level=4 -Cllvm-args=-sanitizer-coverage-trace-compares -Cllvm-args=-sanitizer-coverage-pc-table -Zsanitizer=address -Cembed-bitcode=yes -C codegen-units=1 -L native=/builds/worker/fetches/sysroot-x86_64-linux-gnu/usr/lib/x86_64-linux-gnu -L native=/builds/worker/workspace/obj-build/x86_64-unknown-linux-gnu/release/build/audioipc-9bc9dc40cd5b1425/out -L native=/builds/worker/workspace/obj-build/x86_64-unknown-linux-gnu/release/build/lmdb-rkv-sys-74d114e14081eeaa/out -L native=/builds/worker/workspace/obj-build/x86_64-unknown-linux-gnu/release/build/mozglue-static-c8d195f104f91507/out -L native=/builds/worker/workspace/obj-build/dist/bin -L native=/builds/worker/workspace/obj-build/security/nss/lib/nss/nss_nss3 -L native=/builds/worker/workspace/obj-build/security/nss/lib/ssl/ssl_ssl3 -L native=/builds/worker/workspace/obj-build/config/external/nspr/pr -L native=/builds/worker/workspace/obj-build/x86_64-unknown-linux-gnu/release/build/swgl-5db7aab1244e122d/out`
[task 2021-09-15T16:24:55.130Z] 16:24:55     INFO -  fatal runtime error: Rust cannot catch foreign exceptions
[task 2021-09-15T16:24:55.130Z] 16:24:55     INFO -  sccache: Compiler killed by signal 6
[task 2021-09-15T16:24:55.130Z] 16:24:55     INFO -  error: could not compile `gkrust`
[task 2021-09-15T16:24:55.130Z] 16:24:55     INFO -  Caused by:
[task 2021-09-15T16:24:55.133Z] 16:24:55     INFO -    process didn't exit successfully: `CARGO=/builds/worker/fetches/rustc/bin/cargo CARGO_CRATE_NAME=gkrust CARGO_MANIFEST_DIR=/builds/worker/checkouts/gecko/toolkit/library/rust CARGO_PKG_AUTHORS='nobody@mozilla.org' CARGO_PKG_DESCRIPTION='Rust code for libxul' CARGO_PKG_HOMEPAGE='' CARGO_PKG_LICENSE=MPL-2.0 CARGO_PKG_LICENSE_FILE='' CARGO_PKG_NAME=gkrust CARGO_PKG_REPOSITORY='' CARGO_PKG_VERSION=0.1.0 CARGO_PKG_VERSION_MAJOR=0 CARGO_PKG_VERSION_MINOR=1 CARGO_PKG_VERSION_PATCH=0 CARGO_PKG_VERSION_PRE='' CARGO_PRIMARY_PACKAGE=1 LD_LIBRARY_PATH='/builds/worker/workspace/obj-build/release/deps:/builds/worker/fetches/rustc/lib' /builds/worker/fetches/sccache/sccache /builds/worker/fetches/rustc/bin/rustc --crate-name gkrust toolkit/library/rust/lib.rs --error-format=json --json=diagnostic-rendered-ansi --crate-type staticlib --emit=dep-info,link -C panic=abort -C embed-bitcode=no -Clto -C debug-assertions=off --cfg 'feature="cubeb-remoting"' --cfg 'feature="cubeb_pulse_rust"' --cfg 'feature="gecko_profiler"' --cfg 'feature="gecko_profiler_parse_elf"' --cfg 'feature="glean_disable_upload"' --cfg 'feature="glean_with_gecko"' --cfg 'feature="libfuzzer"' --cfg 'feature="moz_places"' --cfg 'feature="new_xulstore"' --cfg 'feature="simd-accel"' --cfg 'feature="webrtc"' --cfg 'feature="with_dbus"' -C metadata=e04d1b855a2006ef -C extra-filename=-e04d1b855a2006ef --out-dir /builds/worker/workspace/obj-build/x86_64-unknown-linux-gnu/release/deps --target x86_64-unknown-linux-gnu -C linker=/builds/worker/checkouts/gecko/build/cargo-linker -L dependency=/builds/worker/workspace/obj-build/x86_64-unknown-linux-gnu/release/deps -L dependency=/builds/worker/workspace/obj-build/release/deps --extern gkrust_shared=/builds/worker/workspace/obj-build/x86_64-unknown-linux-gnu/release/deps/libgkrust_shared-0008d20980ee8f42.rlib --extern mozglue_static=/builds/worker/workspace/obj-build/x86_64-unknown-linux-gnu/release/deps/libmozglue_static-e563e730029a9aa6.rlib --extern mozilla_central_workspace_hack=/builds/worker/workspace/obj-build/x86_64-unknown-linux-gnu/release/deps/libmozilla_central_workspace_hack-2e29aee84f6d23c3.rlib --extern swgl=/builds/worker/workspace/obj-build/x86_64-unknown-linux-gnu/release/deps/libswgl-ca8196ff7fdb1c2e.rlib -C debug-assertions=no -C debuginfo=2 -C force-frame-pointers=yes -Dwarnings -Aproc-macro-back-compat -Cpasses=sancov -Cllvm-args=-sanitizer-coverage-inline-8bit-counters -Cllvm-args=-sanitizer-coverage-level=4 -Cllvm-args=-sanitizer-coverage-trace-compares -Cllvm-args=-sanitizer-coverage-pc-table -Zsanitizer=address -Cembed-bitcode=yes -C codegen-units=1 -L native=/builds/worker/fetches/sysroot-x86_64-linux-gnu/usr/lib/x86_64-linux-gnu -L native=/builds/worker/workspace/obj-build/x86_64-unknown-linux-gnu/release/build/audioipc-9bc9dc40cd5b1425/out -L native=/builds/worker/workspace/obj-build/x86_64-unknown-linux-gnu/release/build/lmdb-rkv-sys-74d114e14081eeaa/out -L native=/builds/worker/workspace/obj-build/x86_64-unknown-linux-gnu/release/build/mozglue-static-c8d195f104f91507/out -L native=/builds/worker/workspace/obj-build/dist/bin -L native=/builds/worker/workspace/obj-build/security/nss/lib/nss/nss_nss3 -L native=/builds/worker/workspace/obj-build/security/nss/lib/ssl/ssl_ssl3 -L native=/builds/worker/workspace/obj-build/config/external/nspr/pr -L native=/builds/worker/workspace/obj-build/x86_64-unknown-linux-gnu/release/build/swgl-5db7aab1244e122d/out` (exit status: 254)
[task 2021-09-15T16:24:55.133Z] 16:24:55    ERROR -  gmake[4]: *** [/builds/worker/checkouts/gecko/config/makefiles/rust.mk:404: force-cargo-library-build] Error 101
[task 2021-09-15T16:24:55.133Z] 16:24:55     INFO -  gmake[4]: Leaving directory '/builds/worker/workspace/obj-build/toolkit/library/rust'
[task 2021-09-15T16:24:55.133Z] 16:24:55    ERROR -  gmake[3]: *** [/builds/worker/checkouts/gecko/config/recurse.mk:72: toolkit/library/rust/target] Error 2
[task 2021-09-15T16:24:55.133Z] 16:24:55    ERROR -  gmake[2]: *** [/builds/worker/checkouts/gecko/config/recurse.mk:34: compile] Error 2
[task 2021-09-15T16:24:55.133Z] 16:24:55    ERROR -  gmake[1]: *** [/builds/worker/checkouts/gecko/config/rules.mk:358: default] Error 2
[task 2021-09-15T16:24:55.133Z] 16:24:55     INFO -  gmake: *** [client.mk:54: build] Error 2
[task 2021-09-15T17:04:55.157Z] 17:04:55     INFO - Automation Error: mozprocess timed out after 2400 seconds running ['/builds/worker/workspace/obj-build/_virtualenvs/common/bin/python', 'mach', '--log-no-times', 'build', '-v']
[task 2021-09-15T17:04:55.157Z] 17:04:55    ERROR - timed out after 2400 seconds of no output
[task 2021-09-15T17:04:55.157Z] 17:04:55    ERROR - Return code: -15
[task 2021-09-15T17:04:55.157Z] 17:04:55  WARNING - setting return code to 2
[task 2021-09-15T17:04:55.157Z] 17:04:55    FATAL - 'mach build -v' did not run successfully. Please check log for errors.
[task 2021-09-15T17:04:55.157Z] 17:04:55    FATAL - Running post_fatal callback...
[task 2021-09-15T17:04:55.157Z] 17:04:55    FATAL - Exiting -1
Status: NEW → RESOLVED
Closed: 5 years ago
Resolution: --- → DUPLICATE
You need to log in before you can comment on or make changes to this bug.