Closed
Bug 1731400
Opened 3 years ago
Closed 3 years ago
Intermittent testing/firefox-ui/tests/functional/sessionstore/test_restore_windows_after_restart_and_quit.py TestSessionStoreEnabledNoPrivateWindows.test_with_variety | marionette_driver.errors.InvalidSessionIdException: Please start a session
Categories
(Testing :: Firefox UI Tests, defect, P5)
Testing
Firefox UI Tests
Tracking
(Not tracked)
RESOLVED
DUPLICATE
of bug 1382162
People
(Reporter: intermittent-bug-filer, Unassigned)
Details
(Keywords: intermittent-failure)
Filed by: nerli [at] mozilla.com
Parsed log: https://treeherder.mozilla.org/logviewer?job_id=351936280&repo=autoland
Full log: https://firefox-ci-tc.services.mozilla.com/api/queue/v1/task/I-6dOkLMQI6j-RRpTw2_IA/runs/0/artifacts/public/logs/live_backing.log
[task 2021-09-17T21:14:50.692Z] 21:14:50 INFO - TEST-UNEXPECTED-ERROR | testing/firefox-ui/tests/functional/sessionstore/test_restore_windows_after_restart_and_quit.py TestSessionStoreEnabledNoPrivateWindows.test_with_variety | marionette_driver.errors.InvalidSessionIdException: Please start a session
[task 2021-09-17T21:14:50.692Z] 21:14:50 INFO - Traceback (most recent call last):
[task 2021-09-17T21:14:50.692Z] 21:14:50 INFO - File "Z:\task_163191243750876\build\venv\lib\site-packages\marionette_harness\marionette_test\testcases.py", line 235, in run
[task 2021-09-17T21:14:50.692Z] 21:14:50 INFO - self.tearDown()
[task 2021-09-17T21:14:50.692Z] 21:14:50 INFO - File "Z:\task_163191243750876\build\tests\firefox-ui\tests\testing\firefox-ui\tests\functional\sessionstore\session_store_test_case.py", line 87, in tearDown
[task 2021-09-17T21:14:50.692Z] 21:14:50 INFO - super(SessionStoreTestCase, self).tearDown()
[task 2021-09-17T21:14:50.692Z] 21:14:50 INFO - File "Z:\task_163191243750876\build\venv\lib\site-packages\marionette_harness\runner\mixins\window_manager.py", line 24, in tearDown
[task 2021-09-17T21:14:50.692Z] 21:14:50 INFO - if len(self.marionette.chrome_window_handles) > len(self.start_windows):
[task 2021-09-17T21:14:50.702Z] 21:14:50 INFO - File "Z:\task_163191243750876\build\venv\lib\site-packages\marionette_driver\marionette.py", line 1342, in chrome_window_handles
[task 2021-09-17T21:14:50.702Z] 21:14:50 INFO - with self.using_context("chrome"):
[task 2021-09-17T21:14:50.702Z] 21:14:50 INFO - File "c:\mozilla-build\python3\lib\contextlib.py", line 117, in __enter__
[task 2021-09-17T21:14:50.702Z] 21:14:50 INFO - return next(self.gen)
[task 2021-09-17T21:14:50.702Z] 21:14:50 INFO - File "Z:\task_163191243750876\build\venv\lib\site-packages\marionette_driver\marionette.py", line 1411, in using_context
[task 2021-09-17T21:14:50.702Z] 21:14:50 INFO - scope = self._send_message("Marionette:GetContext", key="value")
[task 2021-09-17T21:14:50.702Z] 21:14:50 INFO - File "Z:\task_163191243750876\build\venv\lib\site-packages\marionette_driver\decorators.py", line 27, in _
[task 2021-09-17T21:14:50.702Z] 21:14:50 INFO - return func(*args, **kwargs)
[task 2021-09-17T21:14:50.702Z] 21:14:50 INFO - File "Z:\task_163191243750876\build\venv\lib\site-packages\marionette_driver\marionette.py", line 620, in _send_message
[task 2021-09-17T21:14:50.702Z] 21:14:50 INFO - raise errors.InvalidSessionIdException("Please start a session")
[task 2021-09-17T21:14:50.702Z] 21:14:50 INFO - TEST-INFO took 199640ms
[task 2021-09-17T21:14:50.703Z] 21:14:50 INFO -
[task 2021-09-17T21:14:50.703Z] 21:14:50 INFO - SUMMARY
[task 2021-09-17T21:14:50.703Z] 21:14:50 INFO - -------
[task 2021-09-17T21:14:50.703Z] 21:14:50 INFO - passed: 3
[task 2021-09-17T21:14:50.704Z] 21:14:50 INFO - failed: 1
[task 2021-09-17T21:14:50.704Z] 21:14:50 INFO - todo: 1
[task 2021-09-17T21:14:50.705Z] 21:14:50 INFO -
[task 2021-09-17T21:14:50.705Z] 21:14:50 INFO - FAILED TESTS
[task 2021-09-17T21:14:50.705Z] 21:14:50 INFO - -------
Updated•3 years ago
|
Status: NEW → RESOLVED
Closed: 3 years ago
Resolution: --- → DUPLICATE
Comment hidden (Intermittent Failures Robot) |
You need to log in
before you can comment on or make changes to this bug.
Description
•