Closed Bug 1732467 Opened 1 year ago Closed 1 year ago

Build bustage /builds/worker/checkouts/gecko/dom/quota/test/gtest/TestQMResult.cpp when Gecko 94 merges to Beta on 2021-10-04

Categories

(Core :: Storage: Quota Manager, defect)

Firefox 94
defect

Tracking

()

RESOLVED FIXED
94 Branch
Tracking Status
firefox-esr78 --- unaffected
firefox-esr91 --- unaffected
firefox92 --- unaffected
firefox93 --- unaffected
firefox94 blocking fixed

People

(Reporter: dluca, Unassigned)

References

(Regression)

Details

(Keywords: regression)

Central-as-late-beta:
https://treeherder.mozilla.org/jobs?repo=try&revision=cb6c54cf0c796d23d1599cc01a6402872454a460

Log:
https://treeherder.mozilla.org/logviewer?job_id=352658947&repo=try&lineNumber=11124

 INFO -  dom/security/featurepolicy/Unified_cpp_featurepolicy0.o
[task 2021-09-24T12:58:15.858Z] 12:58:15     INFO -  gmake[4]: Leaving directory '/builds/worker/workspace/obj-build/dom/security/featurepolicy'
[task 2021-09-24T12:58:15.911Z] 12:58:15     INFO -  gmake[4]: Entering directory '/builds/worker/workspace/obj-build/dom/quota/test/gtest'
[task 2021-09-24T12:58:15.911Z] 12:58:15     INFO -  /builds/worker/fetches/clang/bin/clang++ -std=gnu++17 --target=i686-linux-android -o Unified_cpp_dom_quota_test_gtest0.o -c  -I/builds/worker/workspace/obj-build/dist/stl_wrappers -I/builds/worker/workspace/obj-build/dist/system_wrappers -include /builds/worker/checkouts/gecko/config/gcc_hidden.h -fstack-protector-strong -fstack-clash-protection -DNDEBUG=1 -DTRIMMED=1 -DOS_POSIX=1 -DOS_LINUX=1 -DMOZ_HAS_MOZGLUE -DMOZILLA_INTERNAL_API -DIMPL_LIBXUL -DSTATIC_EXPORTABLE_JS_API -I/builds/worker/checkouts/gecko/dom/quota/test/gtest -I/builds/worker/workspace/obj-build/dom/quota/test/gtest -I/builds/worker/workspace/obj-build/ipc/ipdl/_ipdlheaders -I/builds/worker/checkouts/gecko/ipc/chromium/src -I/builds/worker/checkouts/gecko/dom/quota -I/builds/worker/workspace/obj-build/dist/include -I/builds/worker/workspace/obj-build/dist/include/nspr -I/builds/worker/workspace/obj-build/dist/include/nss -DMOZILLA_CLIENT -include /builds/worker/workspace/obj-build/mozilla-config.h -Qunused-arguments -isystem /builds/worker/fetches/android-ndk/sysroot/usr/include/i686-linux-android -isystem /builds/worker/fetches/android-ndk/sysroot/usr/include -gcc-toolchain /builds/worker/fetches/android-ndk/toolchains/x86-4.9/prebuilt/linux-x86_64 -D__ANDROID_API__=16 -Qunused-arguments -Wall -Wbitfield-enum-conversion -Wdeprecated-this-capture -Wempty-body -Wformat-type-confusion -Wignored-qualifiers -Wpointer-arith -Wshadow-field-in-constructor-modified -Wshadow-uncaptured-local -Wsign-compare -Wtype-limits -Wno-error=tautological-type-limit-compare -Wunreachable-code -Wunreachable-code-return -Wno-invalid-offsetof -Wclass-varargs -Wempty-init-stmt -Wfloat-overflow-conversion -Wfloat-zero-conversion -Wloop-analysis -Wno-range-loop-analysis -Wc++2a-compat -Wcomma -Wenum-compare-conditional -Wimplicit-fallthrough -Werror=non-literal-null-conversion -Wstring-conversion -Wno-inline-new-delete -Wno-error=deprecated-declarations -Wno-error=array-bounds -Wno-error=backend-plugin -Wno-error=free-nonheap-object -Wno-error=return-std-move -Wno-error=atomic-alignment -Wno-error=deprecated-copy -Wformat -Wformat-security -Wno-gnu-zero-variadic-macro-arguments -Wno-psabi -Wno-unknown-warning-option -fno-sized-deallocation -fno-aligned-new -fno-short-enums -fno-exceptions -fcrash-diagnostics-dir=/builds/worker/artifacts/en-US -stdlib=libstdc++ -I/builds/worker/fetches/android-ndk/sources/cxx-stl/llvm-libc++/include -I/builds/worker/fetches/android-ndk/sources/android/support/include -I/builds/worker/fetches/android-ndk/sources/cxx-stl/llvm-libc++abi/include -fno-exceptions -fno-strict-aliasing -fPIC -fno-rtti -ffunction-sections -fdata-sections -fno-exceptions -fno-math-errno -pipe -g -Xclang -load -Xclang /builds/worker/workspace/obj-build/build/clang-plugin/libclang-plugin.so -Xclang -add-plugin -Xclang moz-check -Oz -mno-outline -fomit-frame-pointer -funwind-tables -Werror -fexperimental-new-pass-manager  -MD -MP -MF .deps/Unified_cpp_dom_quota_test_gtest0.o.pp   Unified_cpp_dom_quota_test_gtest0.cpp
[task 2021-09-24T12:58:15.911Z] 12:58:15     INFO -  In file included from Unified_cpp_dom_quota_test_gtest0.cpp:38:
[task 2021-09-24T12:58:15.911Z] 12:58:15    ERROR -  /builds/worker/checkouts/gecko/dom/quota/test/gtest/TestQMResult.cpp:21:58: error: member reference base type 'mozilla::QMResult' (aka 'nsresult') is not a structure or union
[task 2021-09-24T12:58:15.911Z] 12:58:15     INFO -    static void SetUpTestCase() { gBaseStackId = QMResult().StackId(); }
[task 2021-09-24T12:58:15.911Z] 12:58:15     INFO -                                                 ~~~~~~~~~~^~~~~~~~
[task 2021-09-24T12:58:15.911Z] 12:58:15     INFO -  1 error generated.
[task 2021-09-24T12:58:15.911Z] 12:58:15    ERROR -  gmake[4]: *** [/builds/worker/checkouts/gecko/config/rules.mk:676: Unified_cpp_dom_quota_test_gtest0.o] Error 1
[task 2021-09-24T12:58:15.911Z] 12:58:15     INFO -  gmake[4]: Leaving directory '/builds/worker/workspace/obj-build/dom/quota/test/gtest'
[task 2021-09-24T12:58:15.911Z] 12:58:15    ERROR -  gmake[3]: *** [/builds/worker/checkouts/gecko/config/recurse.mk:72: dom/quota/test/gtest/target-objects] Error 2
[task 2021-09-24T12:58:15.912Z] 12:58:15     INFO -  gmake[3]: *** Waiting for unfinished jobs....
[task 2021-09-24T12:58:15.912Z] 12:58:15     INFO -  gmake[4]: Entering directory '/builds/worker/workspace/obj-build/dom/media/webrtc/transport/build'
[task 2021-09-24T12:58:15.912Z] 12:58:15     INFO -  dom/media/webrtc/transport/build/transportflow.o
[task 2021-09-24T12:58:15.913Z] 12:58:15     INFO -  gmake[4]: Leaving directory '/builds/worker/workspace/obj-build/dom/media/webrtc/transport/build'
[task 2021-09-24T12:58:17.094Z] 12:58:17     INFO -  gmake[4]: Entering directory '/builds/worker/workspace/obj-build/dom/base'
[task 2021-09-24T12:58:17.094Z] 12:58:17     INFO -  /builds/worker/fetches/clang/bin/clang++ -std=gnu++17 --target=i686-linux-android -o Unified_cpp_dom_base7.o -c  -I/builds/worker/workspace/obj-build/dist/stl_wrappers -I/builds/worker/workspace/obj-build/dist/system_wrappers -include /builds/worker/checkouts/gecko/config/gcc_hidden.h -fstack-protector-strong -fstack-clash-protection -DNDEBUG=1 -DTRIMMED=1 -DOS_POSIX=1 -DOS_LINUX=1 -DMOZ_HAS_MOZGLUE -DMOZILLA_INTERNAL_API -DIMPL_LIBXUL -DSTATIC_EXPORTABLE_JS_API -I/builds/worker/checkouts/gecko/dom/base -I/builds/worker/workspace/obj-build/dom/base -I/builds/worker/checkouts/gecko/dom/battery -I/builds/worker/checkouts/gecko/dom/events -I/builds/worker/checkouts/gecko/dom/media -I/builds/worker/checkouts/gecko/dom/network -I/builds/worker/checkouts/gecko/caps -I/builds/worker/checkouts/gecko/docshell/base -I/builds/worker/checkouts/gecko/dom/base -I/builds/worker/checkouts/gecko/dom/file -I/builds/worker/checkouts/gecko/dom/geolocation -I/builds/worker/checkouts/gecko/dom/html -I/builds/worker/checkouts/gecko/dom/ipc -I/builds/worker/checkouts/gecko/dom/storage -I/builds/worker/checkouts/gecko/dom/svg -I/builds/worker/checkouts/gecko/dom/u2f -I/builds/worker/checkouts/gecko/dom/xml -I/builds/worker/checkouts/gecko/dom/xslt/xpath -I/builds/worker/checkouts/gecko/dom/xul -I/builds/worker/checkouts/gecko/gfx/2d -I/builds/worker/checkouts/gecko/image -I/builds/worker/checkouts/gecko/js/xpconnect/loader -I/builds/worker/checkouts/gecko/js/xpconnect/src -I/builds/worker/checkouts/gecko/js/xpconnect/wrappers -I/builds/worker/checkouts/gecko/layout/base -I/builds/worker/checkouts/gecko/layout/forms -I/builds/worker/checkouts/gecko/layout/generic -I/builds/worker/checkouts/gecko/layout/style -I/builds/worker/checkouts/gecko/layout/xul -I/builds/worker/checkouts/gecko/netwerk/base -I/builds/worker/checkouts/gecko/netwerk/url-classifier -I/builds/worker/checkouts/gecko/security/manager/ssl -I/builds/worker/checkouts/gecko/widget -I/builds/worker/checkouts/gecko/xpcom/ds -I/builds/worker/checkouts/gecko/netwerk/sctp/datachannel -I/builds/worker/workspace/obj-build/ipc/ipdl/_ipdlheaders -I/builds/worker/checkouts/gecko/ipc/chromium/src -I/builds/worker/workspace/obj-build/dist/include -I/builds/worker/workspace/obj-build/dist/include/nspr -I/builds/worker/workspace/obj-build/dist/include/nss -DMOZILLA_CLIENT -include /builds/worker/workspace/obj-build/mozilla-config.h -Qunused-arguments -isystem /builds/worker/fetches/android-ndk/sysroot/usr/include/i686-linux-android -isystem /builds/worker/fetches/android-ndk/sysroot/usr/include -gcc-toolchain /builds/worker/fetches/android-ndk/toolchains/x86-4.9/prebuilt/linux-x86_64 -D__ANDROID_API__=16 -Qunused-arguments -Wall -Wbitfield-enum-conversion -Wdeprecated-this-capture -Wempty-body -Wformat-type-confusion -Wignored-qualifiers -Wpointer-arith -Wshadow-field-in-constructor-modified -Wshadow-uncaptured-local -Wsign-compare -Wtype-limits -Wno-error=tautological-type-limit-compare -Wunreachable-code -Wunreachable-code-return -Wno-invalid-offsetof -Wclass-varargs -Wempty-init-stmt -Wfloat-overflow-conversion -Wfloat-zero-conversion -Wloop-analysis -Wno-range-loop-analysis -Wc++2a-compat -Wcomma -Wenum-compare-conditional -Wimplicit-fallthrough -Werror=non-literal-null-conversion -Wstring-conversion -Wno-inline-new-delete -Wno-error=deprecated-declarations -Wno-error=array-bounds -Wno-error=backend-plugin -Wno-error=free-nonheap-object -Wno-error=return-std-move -Wno-error=atomic-alignment -Wno-error=deprecated-copy -Wformat -Wformat-security -Wno-gnu-zero-variadic-macro-arguments -Wno-psabi -Wno-unknown-warning-option -fno-sized-deallocation -fno-aligned-new -fno-short-enums -fno-exceptions -fcrash-diagnostics-dir=/builds/worker/artifacts/en-US -stdlib=libstdc++ -I/builds/worker/fetches/android-ndk/sources/cxx-stl/llvm-libc++/include -I/builds/worker/fetches/android-ndk/sources/android/support/include -I/builds/worker/fetches/android-ndk/sources/cxx-stl/llvm-libc++abi/include -fno-exceptions -fno-strict-aliasing -fPIC -fno-rtti -ffunction-sections -fdata-sections -fno-exceptions -fno-math-errno -pipe -g -Xclang -load -Xclang /builds/worker/workspace/obj-build/build/clang-plugin/libclang-plugin.so -Xclang -add-plugin -Xclang moz-check -Oz -mno-outline -fomit-frame-pointer -funwind-tables -Werror -Wno-error=shadow -fexperimental-new-pass-manager  -MD -MP -MF .deps/Unified_cpp_dom_base7.o.pp   Unified_cpp_dom_base7.cpp
[task 2021-09-24T12:58:17.094Z] 12:58:17     INFO -  gmake[4]: Leaving directory '/builds/worker/workspace/obj-build/dom/base'
[task 2021-09-24T12:58:17.094Z] 12:58:17     INFO -  gmake[4]: Entering directory '/builds/worker/workspace/obj-build/dom/base'
[task 2021-09-24T12:58:17.094Z] 12:58:17     INFO -  dom/base/Unified_cpp_dom_base9.o

Backing out Bug 1728267 fixes the issue:
https://hg.mozilla.org/try/rev/0828eb8f1665686473b7fc2f9668afaa1b56ce9d

Jan: Can you please take a look at this bug?

Flags: needinfo?(jvarga)

Ok, sorry about that.
Here's a fix: https://phabricator.services.mozilla.com/D126589

Flags: needinfo?(jvarga)
Status: NEW → RESOLVED
Closed: 1 year ago
Resolution: --- → FIXED
Target Milestone: --- → 94 Branch
Has Regression Range: --- → yes
You need to log in before you can comment on or make changes to this bug.