Closed Bug 1733737 Opened 2 months ago Closed 2 months ago

High frequency Assertion failure: mSearchesOngoing > 0 && mSearches.Contains(aSearch), at /builds/worker/checkouts/gecko/toolkit/components/autocomplete/nsAutoCompleteController.cpp:813

Categories

(Toolkit :: Autocomplete, defect, P5)

defect

Tracking

()

RESOLVED FIXED
95 Branch
Tracking Status
firefox-esr78 --- unaffected
firefox-esr91 --- unaffected
firefox93 --- unaffected
firefox94 --- fixed
firefox95 --- fixed

People

(Reporter: intermittent-bug-filer, Assigned: owlish)

References

(Regression)

Details

(Keywords: assertion, intermittent-failure, regression, Whiteboard: [geckoview:m95][stockwell disable-recommended])

Attachments

(1 file, 1 obsolete file)

Filed by: imoraru [at] mozilla.com
Parsed log: https://treeherder.mozilla.org/logviewer?job_id=353421647&repo=autoland
Full log: https://firefox-ci-tc.services.mozilla.com/api/queue/v1/task/BDXyjvsrS1GEpsBP69pAUQ/runs/0/artifacts/public/logs/live_backing.log


[task 2021-10-02T00:49:36.439Z] 00:49:36     INFO -  10-02 00:49:34.861 D/GeckoViewAutofill( 3869): Auto-fill focus on INPUT
[task 2021-10-02T00:49:36.439Z] 00:49:36     INFO -  10-02 00:49:34.863 F/MOZ_Assert( 3869): Assertion failure: mSearchesOngoing > 0 && mSearches.Contains(aSearch), at /builds/worker/checkouts/gecko/toolkit/components/autocomplete/nsAutoCompleteController.cpp:813
[task 2021-10-02T00:49:36.439Z] 00:49:36     INFO -  10-02 00:49:34.863 F/MOZ_Assert( 3869): #01: ???[/data/app/org.mozilla.geckoview.test-1/lib/x86_64/libxul.so +0x4ca8eef]
[task 2021-10-02T00:49:36.439Z] 00:49:36     INFO -  10-02 00:49:34.863 F/MOZ_Assert( 3869):
[task 2021-10-02T00:49:36.439Z] 00:49:36     INFO -  10-02 00:49:34.864 F/MOZ_Assert( 3869): #02: ???[/data/app/org.mozilla.geckoview.test-1/lib/x86_64/libxul.so +0x4ca9439]
[task 2021-10-02T00:49:36.439Z] 00:49:36     INFO -  10-02 00:49:34.864 F/MOZ_Assert( 3869):
[task 2021-10-02T00:49:36.439Z] 00:49:36     INFO -  10-02 00:49:34.864 F/MOZ_Assert( 3869): #03: ???[/data/app/org.mozilla.geckoview.test-1/lib/x86_64/libxul.so +0x124239a]
[task 2021-10-02T00:49:36.439Z] 00:49:36     INFO -  10-02 00:49:34.864 F/MOZ_Assert( 3869):
[task 2021-10-02T00:49:36.439Z] 00:49:36     INFO -  10-02 00:49:34.864 F/MOZ_Assert( 3869): #04: ???[/data/app/org.mozilla.geckoview.test-1/lib/x86_64/libxul.so +0x1c1a556]
[task 2021-10-02T00:49:36.439Z] 00:49:36     INFO -  10-02 00:49:34.864 F/MOZ_Assert( 3869):
[task 2021-10-02T00:49:36.440Z] 00:49:36     INFO -  10-02 00:49:34.864 F/MOZ_Assert( 3869): #05: ???[/data/app/org.mozilla.geckoview.test-1/lib/x86_64/libxul.so +0x1c1a3ca]
[task 2021-10-02T00:49:36.440Z] 00:49:36     INFO -  10-02 00:49:34.864 F/MOZ_Assert( 3869):
[task 2021-10-02T00:49:36.440Z] 00:49:36     INFO -  10-02 00:49:34.864 F/MOZ_Assert( 3869): #06: ???[/data/app/org.mozilla.geckoview.test-1/lib/x86_64/libxul.so +0x1c1b6ff]
[task 2021-10-02T00:49:36.440Z] 00:49:36     INFO -  10-02 00:49:34.864 F/MOZ_Assert( 3869):
[task 2021-10-02T00:49:36.440Z] 00:49:36     INFO -  10-02 00:49:34.864 F/MOZ_Assert( 3869): #07: ???[/data/app/org.mozilla.geckoview.test-1/lib/x86_64/libxul.so +0x4e2dfe8]
[task 2021-10-02T00:49:36.440Z] 00:49:36     INFO -  10-02 00:49:34.864 F/MOZ_Assert( 3869):
[task 2021-10-02T00:49:36.440Z] 00:49:36     INFO -  10-02 00:49:34.864 F/MOZ_Assert( 3869): #08: ???[/data/app/org.mozilla.geckoview.test-1/lib/x86_64/libxul.so +0x4e2d850]
[task 2021-10-02T00:49:36.440Z] 00:49:36     INFO -  10-02 00:49:34.864 F/MOZ_Assert( 3869):
[task 2021-10-02T00:49:36.440Z] 00:49:36     INFO -  10-02 00:49:34.865 F/MOZ_Assert( 3869): #09: ???[/data/app/org.mozilla.geckoview.test-1/lib/x86_64/libxul.so +0x4e2f060]
[task 2021-10-02T00:49:36.440Z] 00:49:36     INFO -  10-02 00:49:34.865 F/MOZ_Assert( 3869):
[task 2021-10-02T00:49:36.441Z] 00:49:36     INFO -  10-02 00:49:34.865 F/MOZ_Assert( 3869): #10: ???[/data/app/org.mozilla.geckoview.test-1/lib/x86_64/libxul.so +0x4e22dd3]
[task 2021-10-02T00:49:36.441Z] 00:49:36     INFO -  10-02 00:49:34.865 F/MOZ_Assert( 3869):
[task 2021-10-02T00:49:36.441Z] 00:49:36     INFO -  10-02 00:49:34.865 F/MOZ_Assert( 3869): #11: ???[/data/app/org.mozilla.geckoview.test-1/lib/x86_64/libxul.so +0x4e1a630]
[task 2021-10-02T00:49:36.441Z] 00:49:36     INFO -  10-02 00:49:34.865 F/MOZ_Assert( 3869):
[task 2021-10-02T00:49:36.441Z] 00:49:36     INFO -  10-02 00:49:34.865 F/MOZ_Assert( 3869): #12: ???[/data/app/org.mozilla.geckoview.test-1/lib/x86_64/libxul.so +0x4e2d76a]
[task 2021-10-02T00:49:36.441Z] 00:49:36     INFO -  10-02 00:49:34.865 F/MOZ_Assert( 3869):
[task 2021-10-02T00:49:36.441Z] 00:49:36     INFO -  10-02 00:49:34.865 F/MOZ_Assert( 3869): #13: ???[/data/app/org.mozilla.geckoview.test-1/lib/x86_64/libxul.so +0x4e2f060]
[task 2021-10-02T00:49:36.441Z] 00:49:36     INFO -  10-02 00:49:34.865 F/MOZ_Assert( 3869):
[task 2021-10-02T00:49:36.441Z] 00:49:36     INFO -  10-02 00:49:34.865 F/MOZ_Assert( 3869): #14: ???[/data/app/org.mozilla.geckoview.test-1/lib/x86_64/libxul.so +0x4e2f250]
[task 2021-10-02T00:49:36.441Z] 00:49:36     INFO -  10-02 00:49:34.865 F/MOZ_Assert( 3869):
[task 2021-10-02T00:49:36.441Z] 00:49:36     INFO -  10-02 00:49:34.865 F/MOZ_Assert( 3869): #15: ???[/data/app/org.mozilla.geckoview.test-1/lib/x86_64/libxul.so +0x4ea299d]
[task 2021-10-02T00:49:36.441Z] 00:49:36     INFO -  10-02 00:49:34.865 F/MOZ_Assert( 3869):
[task 2021-10-02T00:49:36.442Z] 00:49:36     INFO -  10-02 00:49:34.866 F/MOZ_Assert( 3869): #16: ???[/data/app/org.mozilla.geckoview.test-1/lib/x86_64/libxul.so +0x50baba7]
[task 2021-10-02T00:49:36.442Z] 00:49:36     INFO -  10-02 00:49:34.866 F/MOZ_Assert( 3869):
[task 2021-10-02T00:49:36.442Z] 00:49:36     INFO -  10-02 00:49:34.866 F/MOZ_Assert( 3869): #17: ???[/data/app/org.mozilla.geckoview.test-1/lib/x86_64/libxul.so +0x4e2dfe8]
[task 2021-10-02T00:49:36.442Z] 00:49:36     INFO -  10-02 00:49:34.866 F/MOZ_Assert( 3869):
[task 2021-10-02T00:49:36.442Z] 00:49:36     INFO -  10-02 00:49:34.866 F/MOZ_Assert( 3869): #18: ???[/data/app/org.mozilla.geckoview.test-1/lib/x86_64/libxul.so +0x4e2d850]
[task 2021-10-02T00:49:36.442Z] 00:49:36     INFO -  10-02 00:49:34.866 F/MOZ_Assert( 3869):
[task 2021-10-02T00:49:36.442Z] 00:49:36     INFO -  10-02 00:49:34.866 F/MOZ_Assert( 3869): #19: ???[/data/app/org.mozilla.geckoview.test-1/lib/x86_64/libxul.so +0x4e2f060]
[task 2021-10-02T00:49:36.442Z] 00:49:36     INFO -  10-02 00:49:34.866 F/MOZ_Assert( 3869):
[task 2021-10-02T00:49:36.442Z] 00:49:36     INFO -  10-02 00:49:34.866 F/MOZ_Assert( 3869): #20: ???[/data/app/org.mozilla.geckoview.test-1/lib/x86_64/libxul.so +0x4e2f250]
[task 2021-10-02T00:49:36.442Z] 00:49:36     INFO -  10-02 00:49:34.866 F/MOZ_Assert( 3869):
[task 2021-10-02T00:49:36.442Z] 00:49:36     INFO -  10-02 00:49:34.866 F/MOZ_Assert( 3869): #21: ???[/data/app/org.mozilla.geckoview.test-1/lib/x86_64/libxul.so +0x4fb95cb]
[task 2021-10-02T00:49:36.442Z] 00:49:36     INFO -  10-02 00:49:34.866 F/MOZ_Assert( 3869):
[task 2021-10-02T00:49:36.442Z] 00:49:36     INFO -  10-02 00:49:34.867 F/MOZ_Assert( 3869): #22: ???[/data/app/org.mozilla.geckoview.test-1/lib/x86_64/libxul.so +0x2616653]
[task 2021-10-02T00:49:36.442Z] 00:49:36     INFO -  10-02 00:49:34.867 F/MOZ_Assert( 3869):
[task 2021-10-02T00:49:36.442Z] 00:49:36     INFO -  10-02 00:49:34.867 F/MOZ_Assert( 3869): #23: ???[/data/app/org.mozilla.geckoview.test-1/lib/x86_64/libxul.so +0x1146252]
[task 2021-10-02T00:49:36.442Z] 00:49:36     INFO -  10-02 00:49:34.867 F/MOZ_Assert( 3869):
[task 2021-10-02T00:49:36.443Z] 00:49:36     INFO -  10-02 00:49:34.867 F/MOZ_Assert( 3869): #24: ???[/data/app/org.mozilla.geckoview.test-1/lib/x86_64/libxul.so +0x1146069]
[task 2021-10-02T00:49:36.443Z] 00:49:36     INFO -  10-02 00:49:34.867 F/MOZ_Assert( 3869):
[task 2021-10-02T00:49:36.443Z] 00:49:36     INFO -  10-02 00:49:34.867 F/MOZ_Assert( 3869): #25: ???[/data/app/org.mozilla.geckoview.test-1/lib/x86_64/libxul.so +0x11450eb]
[task 2021-10-02T00:49:36.443Z] 00:49:36     INFO -  10-02 00:49:34.867 F/MOZ_Assert( 3869):
[task 2021-10-02T00:49:36.443Z] 00:49:36     INFO -  10-02 00:49:34.867 F/MOZ_Assert( 3869): #26: ???[/data/app/org.mozilla.geckoview.test-1/lib/x86_64/libxul.so +0x11350f7]
[task 2021-10-02T00:49:36.443Z] 00:49:36     INFO -  10-02 00:49:34.867 F/MOZ_Assert( 3869):
[task 2021-10-02T00:49:36.443Z] 00:49:36     INFO -  10-02 00:49:34.867 F/MOZ_Assert( 3869): #27: ???[/data/app/org.mozilla.geckoview.test-1/lib/x86_64/libxul.so +0x1135a09]
[task 2021-10-02T00:49:36.443Z] 00:49:36     INFO -  10-02 00:49:34.867 F/MOZ_Assert( 3869):
[task 2021-10-02T00:49:36.443Z] 00:49:36     INFO -  10-02 00:49:34.867 F/MOZ_Assert( 3869): #28: ???[/data/app/org.mozilla.geckoview.test-1/lib/x86_64/libxul.so +0x1be8b7a]
[task 2021-10-02T00:49:36.443Z] 00:49:36     INFO -  10-02 00:49:34.867 F/MOZ_Assert( 3869):
[task 2021-10-02T00:49:36.443Z] 00:49:36     INFO -  10-02 00:49:34.867 F/MOZ_Assert( 3869): #29: ???[/data/app/org.mozilla.geckoview.test-1/lib/x86_64/libxul.so +0x1217de2]
[task 2021-10-02T00:49:36.443Z] 00:49:36     INFO -  10-02 00:49:34.867 F/MOZ_Assert( 3869):
[task 2021-10-02T00:49:36.444Z] 00:49:36     INFO -  10-02 00:49:34.867 F/MOZ_Assert( 3869): #30: ???[/data/app/org.mozilla.geckoview.test-1/lib/x86_64/libxul.so +0x121c103]
[task 2021-10-02T00:49:36.444Z] 00:49:36     INFO -  10-02 00:49:34.867 F/MOZ_Assert( 3869):
[task 2021-10-02T00:49:36.444Z] 00:49:36     INFO -  10-02 00:49:34.868 F/MOZ_Assert( 3869): #31: ???[/data/app/org.mozilla.geckoview.test-1/lib/x86_64/libxul.so +0x182b258]
[task 2021-10-02T00:49:36.444Z] 00:49:36     INFO -  10-02 00:49:34.868 F/MOZ_Assert( 3869):
[task 2021-10-02T00:49:36.444Z] 00:49:36     INFO -  10-02 00:49:34.868 F/MOZ_Assert( 3869): #32: ???[/data/app/org.mozilla.geckoview.test-1/lib/x86_64/libxul.so +0x17cce4a]
[task 2021-10-02T00:49:36.444Z] 00:49:36     INFO -  10-02 00:49:34.868 F/MOZ_Assert( 3869):
[task 2021-10-02T00:49:36.444Z] 00:49:36     INFO -  10-02 00:49:34.868 F/MOZ_Assert( 3869): #33: ???[/data/app/org.mozilla.geckoview.test-1/lib/x86_64/libxul.so +0x17ccdb3]
[task 2021-10-02T00:49:36.444Z] 00:49:36     INFO -  10-02 00:49:34.868 F/MOZ_Assert( 3869):
[task 2021-10-02T00:49:36.444Z] 00:49:36     INFO -  10-02 00:49:34.868 F/MOZ_Assert( 3869): #34: ???[/data/app/org.mozilla.geckoview.test-1/lib/x86_64/libxul.so +0x3be7f11]
[task 2021-10-02T00:49:36.444Z] 00:49:36     INFO -  10-02 00:49:34.868 F/MOZ_Assert( 3869):
[task 2021-10-02T00:49:36.445Z] 00:49:36     INFO -  10-02 00:49:34.868 F/MOZ_Assert( 3869): #35: ???[/data/app/org.mozilla.geckoview.test-1/lib/x86_64/libxul.so +0x4ce733f]
[task 2021-10-02T00:49:36.445Z] 00:49:36     INFO -  10-02 00:49:34.868 F/MOZ_Assert( 3869):
[task 2021-10-02T00:49:36.445Z] 00:49:36     INFO -  10-02 00:49:34.868 F/MOZ_Assert( 3869): #36: ???[/data/app/org.mozilla.geckoview.test-1/lib/x86_64/libxul.so +0x182b8c5]
[task 2021-10-02T00:49:36.445Z] 00:49:36     INFO -  10-02 00:49:34.868 F/MOZ_Assert( 3869):
[task 2021-10-02T00:49:36.445Z] 00:49:36     INFO -  10-02 00:49:34.868 F/MOZ_Assert( 3869): #37: ???[/data/app/org.mozilla.geckoview.test-1/lib/x86_64/libxul.so +0x17cce4a]
[task 2021-10-02T00:49:36.445Z] 00:49:36     INFO -  10-02 00:49:34.868 F/MOZ_Assert( 3869):
[task 2021-10-02T00:49:36.445Z] 00:49:36     INFO -  10-02 00:49:34.869 F/MOZ_Assert( 3869): #38: ???[/data/app/org.mozilla.geckoview.test-1/lib/x86_64/libxul.so +0x17ccdb3]
[task 2021-10-02T00:49:36.445Z] 00:49:36     INFO -  10-02 00:49:34.869 F/MOZ_Assert( 3869):
[task 2021-10-02T00:49:36.445Z] 00:49:36     INFO -  10-02 00:49:34.869 F/MOZ_Assert( 3869): #39: ???[/data/app/org.mozilla.geckoview.test-1/lib/x86_64/libxul.so +0x4ce6e06]
[task 2021-10-02T00:49:36.445Z] 00:49:36     INFO -  10-02 00:49:34.869 F/MOZ_Assert( 3869):
[task 2021-10-02T00:49:36.445Z] 00:49:36     INFO -  10-02 00:49:34.869 F/MOZ_Assert( 3869): #40: Java_org_mozilla_gecko_mozglue_GeckoLoader_nativeRun[/data/app/org.mozilla.geckoview.test-1/lib/x86_64/libmozglue.so +0x71491]
[task 2021-10-02T00:49:36.445Z] 00:49:36     INFO -  10-02 00:49:34.869 F/MOZ_Assert( 3869):
[task 2021-10-02T00:49:36.445Z] 00:49:36     INFO -  10-02 00:49:34.869 F/MOZ_Assert( 3869): #41: oatexec[/data/app/org.mozilla.geckoview.test-1/oat/x86_64/base.odex +0xcbaf1f]
[task 2021-10-02T00:49:36.445Z] 00:49:36     INFO -  10-02 00:49:34.869 F/MOZ_Assert( 3869):
[task 2021-10-02T00:49:36.445Z] 00:49:36     INFO -  10-02 00:49:34.904 D/GeckoSession( 3464): handleMessage GeckoView:StateUpdated uri=null
[task 2021-10-02T00:49:36.446Z] 00:49:36     INFO -  10-02 00:49:34.904 W/GeckoSession( 3464): No history entries found.
[task 2021-10-02T00:49:36.446Z] 00:49:36     INFO -  10-02 00:49:34.905 D/GeckoViewConsole( 3464): onEvent GeckoView:WebExtension:PortMessageFromApp {"message":{"id":"49f0ee2c-ffc4-4235-89e4-43def3b1f8b7","eval":"document.querySelector('#expMonth').value = '11'"}}
[task 2021-10-02T00:49:36.446Z] 00:49:36     INFO -  10-02 00:49:34.990 I/ActivityManager( 1645): Process org.mozilla.geckoview.test:tab31 (pid 3869) has died
Regressed by: 1703976

Set release status flags based on info from the regressing bug 1703976

Assignee: nobody → bugzeeeeee
Rank: 1
Priority: P5 → P1
Whiteboard: [geckoview:m95]
Priority: P1 → P5

Just realised this was not in GV component so resetting priority. Sorry.

Attachment #9244999 - Attachment is obsolete: true
Summary: Intermittent Assertion failure: mSearchesOngoing > 0 && mSearches.Contains(aSearch), at /builds/worker/checkouts/gecko/toolkit/components/autocomplete/nsAutoCompleteController.cpp:813 → High frequency Assertion failure: mSearchesOngoing > 0 && mSearches.Contains(aSearch), at /builds/worker/checkouts/gecko/toolkit/components/autocomplete/nsAutoCompleteController.cpp:813

There are 109 total failures in the last 7 days on

task 2021-10-12T10:58:41.050Z] 10:58:41     INFO -  Printing logcat for test:
[task 2021-10-12T10:58:41.103Z] 10:58:41     INFO -  10-12 10:58:38.819 E/GeckoSessionTestRule( 3454): test_start 1f0befec-3ff2-40ff-89cf-b127eb38b1ec creditCardUpdateAccept(org.mozilla.geckoview.test.AutocompleteTest)
[task 2021-10-12T10:58:41.103Z] 10:58:41     INFO -  10-12 10:58:38.819 E/GeckoSessionTestRule( 3454): before prepareStatement creditCardUpdateAccept(org.mozilla.geckoview.test.AutocompleteTest)
[task 2021-10-12T10:58:41.103Z] 10:58:41     INFO -  10-12 10:58:38.820 D/GeckoViewMediaControl[C]( 5296): onDisable
[task 2021-10-12T10:58:41.104Z] 10:58:41     INFO -  10-12 10:58:38.822 I/Gecko   ( 3454): nsWindow[0x76cfcfda3c00]::Create 0x0 [0 0 1 1]
[task 2021-10-12T10:58:41.104Z] 10:58:41     INFO -  10-12 10:58:38.823 D/GeckoViewSelectionActionDelegate[C]( 5296): handleEvent: visibilitychange
[task 2021-10-12T10:58:41.104Z] 10:58:41     INFO -  10-12 10:58:38.823 D/GeckoViewAutoFill[C]( 5296): handleEvent: pagehide
[task 2021-10-12T10:58:41.149Z] 10:58:41     INFO -  10-12 10:58:40.173 I/Gecko   ( 5338): [Child 5338, Main Thread] WARNING: EditorBase::GetInlineSpellChecker() failed, but ignored: 'NS_SUCCEEDED(rvIgnored)', file /builds/worker/checkouts/gecko/editor/libeditor/EditorBase.cpp:1968
[task 2021-10-12T10:58:41.149Z] 10:58:41     INFO -  10-12 10:58:40.177 D/GeckoViewAutoFill[C]( 5338): handleEvent: focusin
[task 2021-10-12T10:58:41.149Z] 10:58:41     INFO -  10-12 10:58:40.178 D/GeckoViewAutofill( 5338): Auto-fill focus on INPUT
[task 2021-10-12T10:58:41.149Z] 10:58:41     INFO -  10-12 10:58:40.219 F/MOZ_Assert( 5338): Assertion failure: mSearchesOngoing > 0 && mSearches.Contains(aSearch), at /builds/worker/checkouts/gecko/toolkit/components/autocomplete/nsAutoCompleteController.cpp:813
[task 2021-10-12T10:58:41.149Z] 10:58:41     INFO -  10-12 10:58:40.220 F/MOZ_Assert( 5338): #01: ???[/data/app/org.mozilla.geckoview.test-1/lib/x86_64/libxul.so +0x4cf6019]
[task 2021-10-12T10:58:41.149Z] 10:58:41     INFO -  10-12 10:58:40.220 F/MOZ_Assert( 5338):
[task 2021-10-12T10:58:41.149Z] 10:58:41     INFO -  10-12 10:58:40.220 D/GeckoViewAutocomplete( 3454): fetchAddresses
[task 2021-10-12T10:58:41.149Z] 10:58:41     INFO -  10-12 10:58:40.221 F/MOZ_Assert( 5338): #02: ???[/data/app/org.mozilla.geckoview.test-1/lib/x86_64/libxul.so +0x4cf6563]
[task 2021-10-12T10:58:41.149Z] 10:58:41     INFO -  10-12 10:58:40.221 F/MOZ_Assert( 5338):
[task 2021-10-12T10:58:41.149Z] 10:58:41     INFO -  10-12 10:58:40.221 F/MOZ_Assert( 5338): #03: ???[/data/app/org.mozilla.geckoview.test-1/lib/x86_64/libxul.so +0x1253dea]
[task 2021-10-12T10:58:41.150Z] 10:58:41     INFO -  10-12 10:58:40.221 F/MOZ_Assert( 5338):
[task 2021-10-12T10:58:41.150Z] 10:58:41     INFO -  10-12 10:58:40.221 F/MOZ_Assert( 5338): #04: ???[/data/app/org.mozilla.geckoview.test-1/lib/x86_64/libxul.so +0x1c3714c]
[task 2021-10-12T10:58:41.150Z] 10:58:41     INFO -  10-12 10:58:40.221 F/MOZ_Assert( 5338):
[task 2021-10-12T10:58:41.150Z] 10:58:41     INFO -  10-12 10:58:40.221 F/MOZ_Assert( 5338): #05: ???[/data/app/org.mozilla.geckoview.test-1/lib/x86_64/libxul.so +0x1c36fc0]
[task 2021-10-12T10:58:41.150Z] 10:58:41     INFO -  10-12 10:58:40.221 F/MOZ_Assert( 5338):
[task 2021-10-12T10:58:41.150Z] 10:58:41     INFO -  10-12 10:58:40.221 D/GeckoViewConsole( 3454): onEvent GeckoView:WebExtension:PortMessageFromApp {"message":{"id":"af3a9162-bf93-49e3-8f2b-d8d9c9a05153","eval":"document.querySelector('#expMonth').value = '11'"}}
[task 2021-10-12T10:58:41.150Z] 10:58:41     INFO -  10-12 10:58:40.221 F/MOZ_Assert( 5338): #06: ???[/data/app/org.mozilla.geckoview.test-1/lib/x86_64/libxul.so +0x1c382f5]
[task 2021-10-12T10:58:41.150Z] 10:58:41     INFO -  10-12 10:58:40.221 F/MOZ_Assert( 5338):
[task 2021-10-12T10:58:41.150Z] 10:58:41     INFO -  10-12 10:58:40.222 F/MOZ_Assert( 5338): #07: ???[/data/app/org.mozilla.geckoview.test-1/lib/x86_64/libxul.so +0x4e7bba8]
[task 2021-10-12T10:58:41.150Z] 10:58:41     INFO -  10-12 10:58:40.222 F/MOZ_Assert( 5338):
[task 2021-10-12T10:58:41.150Z] 10:58:41     INFO -  10-12 10:58:40.222 F/MOZ_Assert( 5338): #08: ???[/data/app/org.mozilla.geckoview.test-1/lib/x86_64/libxul.so +0x4e7b410]
[task 2021-10-12T10:58:41.151Z] 10:58:41     INFO -  10-12 10:58:40.222 F/MOZ_Assert( 5338):
[task 2021-10-12T10:58:41.151Z] 10:58:41     INFO -  10-12 10:58:40.222 F/MOZ_Assert( 5338): #09: ???[/data/app/org.mozilla.geckoview.test-1/lib/x86_64/libxul.so +0x4e7cc20]
[task 2021-10-12T10:58:41.151Z] 10:58:41     INFO -  10-12 10:58:40.222 F/MOZ_Assert( 5338):
[task 2021-10-12T10:58:41.151Z] 10:58:41     INFO -  10-12 10:58:40.223 F/MOZ_Assert( 5338): #10: ???[/data/app/org.mozilla.geckoview.test-1/lib/x86_64/libxul.so +0x4e70993]
[task 2021-10-12T10:58:41.151Z] 10:58:41     INFO -  10-12 10:58:40.223 F/MOZ_Assert( 5338):
[task 2021-10-12T10:58:41.151Z] 10:58:41     INFO -  10-12 10:58:40.223 F/MOZ_Assert( 5338): #11: ???[/data/app/org.mozilla.geckoview.test-1/lib/x86_64/libxul.so +0x4e681f0]
[task 2021-10-12T10:58:41.151Z] 10:58:41     INFO -  10-12 10:58:40.223 F/MOZ_Assert( 5338):
[task 2021-10-12T10:58:41.151Z] 10:58:41     INFO -  10-12 10:58:40.223 D/GeckoViewAutocomplete( 3454): fetchCreditCards
[task 2021-10-12T10:58:41.151Z] 10:58:41     INFO -  10-12 10:58:40.223 F/MOZ_Assert( 5338): #12: ???[/data/app/org.mozilla.geckoview.test-1/lib/x86_64/libxul.so +0x4e7b32a]
[task 2021-10-12T10:58:41.151Z] 10:58:41     INFO -  10-12 10:58:40.223 F/MOZ_Assert( 5338):
[task 2021-10-12T10:58:41.151Z] 10:58:41     INFO -  10-12 10:58:40.223 F/MOZ_Assert( 5338): #13: ???[/data/app/org.mozilla.geckoview.test-1/lib/x86_64/libxul.so +0x4e7cc20]
[task 2021-10-12T10:58:41.152Z] 10:58:41     INFO -  10-12 10:58:40.223 F/MOZ_Assert( 5338):
[task 2021-10-12T10:58:41.152Z] 10:58:41     INFO -  10-12 10:58:40.224 F/MOZ_Assert( 5338): #14: ???[/data/app/org.mozilla.geckoview.test-1/lib/x86_64/libxul.so +0x4e7ce10]
[task 2021-10-12T10:58:41.152Z] 10:58:41     INFO -  10-12 10:58:40.224 F/MOZ_Assert( 5338):
[task 2021-10-12T10:58:41.152Z] 10:58:41     INFO -  10-12 10:58:40.224 F/MOZ_Assert( 5338): #15: ???[/data/app/org.mozilla.geckoview.test-1/lib/x86_64/libxul.so +0x4ef05cd]
[task 2021-10-12T10:58:41.152Z] 10:58:41     INFO -  10-12 10:58:40.224 F/MOZ_Assert( 5338):
[task 2021-10-12T10:58:41.152Z] 10:58:41     INFO -  10-12 10:58:40.224 F/MOZ_Assert( 5338): #16: ???[/data/app/org.mozilla.geckoview.test-1/lib/x86_64/libxul.so +0x5108327]
[task 2021-10-12T10:58:41.152Z] 10:58:41     INFO -  10-12 10:58:40.224 F/MOZ_Assert( 5338):
[task 2021-10-12T10:58:41.152Z] 10:58:41     INFO -  10-12 10:58:40.225 F/MOZ_Assert( 5338): #17: ???[/data/app/org.mozilla.geckoview.test-1/lib/x86_64/libxul.so +0x4e7bba8]
[task 2021-10-12T10:58:41.152Z] 10:58:41     INFO -  10-12 10:58:40.225 F/MOZ_Assert( 5338):
[task 2021-10-12T10:58:41.152Z] 10:58:41     INFO -  10-12 10:58:40.225 F/MOZ_Assert( 5338): #18: ???[/data/app/org.mozilla.geckoview.test-1/lib/x86_64/libxul.so +0x4e7b410]
[task 2021-10-12T10:58:41.152Z] 10:58:41     INFO -  10-12 10:58:40.225 F/MOZ_Assert( 5338):
[task 2021-10-12T10:58:41.152Z] 10:58:41     INFO -  10-12 10:58:40.225 F/MOZ_Assert( 5338): #19: ???[/data/app/org.mozilla.geckoview.test-1/lib/x86_64/libxul.so +0x4e7cc20]
[task 2021-10-12T10:58:41.152Z] 10:58:41     INFO -  10-12 10:58:40.225 F/MOZ_Assert( 5338):
[task 2021-10-12T10:58:41.152Z] 10:58:41     INFO -  10-12 10:58:40.225 F/MOZ_Assert( 5338): #20: ???[/data/app/org.mozilla.geckoview.test-1/lib/x86_64/libxul.so +0x4e7ce10]
[task 2021-10-12T10:58:41.152Z] 10:58:41     INFO -  10-12 10:58:40.225 F/MOZ_Assert( 5338):
[task 2021-10-12T10:58:41.153Z] 10:58:41     INFO -  10-12 10:58:40.226 F/MOZ_Assert( 5338): #21: ???[/data/app/org.mozilla.geckoview.test-1/lib/x86_64/libxul.so +0x5004fbb]
[task 2021-10-12T10:58:41.153Z] 10:58:41     INFO -  10-12 10:58:40.226 F/MOZ_Assert( 5338):
[task 2021-10-12T10:58:41.153Z] 10:58:41     INFO -  10-12 10:58:40.226 F/MOZ_Assert( 5338): #22: ???[/data/app/org.mozilla.geckoview.test-1/lib/x86_64/libxul.so +0x2648adf]
[task 2021-10-12T10:58:41.153Z] 10:58:41     INFO -  10-12 10:58:40.226 F/MOZ_Assert( 5338):
[task 2021-10-12T10:58:41.153Z] 10:58:41     INFO -  10-12 10:58:40.226 F/MOZ_Assert( 5338): #23: ???[/data/app/org.mozilla.geckoview.test-1/lib/x86_64/libxul.so +0x1156dca]
[task 2021-10-12T10:58:41.153Z] 10:58:41     INFO -  10-12 10:58:40.226 F/MOZ_Assert( 5338):
[task 2021-10-12T10:58:41.153Z] 10:58:41     INFO -  10-12 10:58:40.226 F/MOZ_Assert( 5338): #24: ???[/data/app/org.mozilla.geckoview.test-1/lib/x86_64/libxul.so +0x1156be1]
[task 2021-10-12T10:58:41.153Z] 10:58:41     INFO -  10-12 10:58:40.226 F/MOZ_Assert( 5338):
[task 2021-10-12T10:58:41.153Z] 10:58:41     INFO -  10-12 10:58:40.227 F/MOZ_Assert( 5338): #25: ???[/data/app/org.mozilla.geckoview.test-1/lib/x86_64/libxul.so +0x1155af5]
[task 2021-10-12T10:58:41.153Z] 10:58:41     INFO -  10-12 10:58:40.227 F/MOZ_Assert( 5338):
[task 2021-10-12T10:58:41.153Z] 10:58:41     INFO -  10-12 10:58:40.227 F/MOZ_Assert( 5338): #26: ???[/data/app/org.mozilla.geckoview.test-1/lib/x86_64/libxul.so +0x1145737]
[task 2021-10-12T10:58:41.153Z] 10:58:41     INFO -  10-12 10:58:40.227 F/MOZ_Assert( 5338):
[task 2021-10-12T10:58:41.153Z] 10:58:41     INFO -  10-12 10:58:40.227 F/MOZ_Assert( 5338): #27: ???[/data/app/org.mozilla.geckoview.test-1/lib/x86_64/libxul.so +0x1146049]
[task 2021-10-12T10:58:41.154Z] 10:58:41     INFO -  10-12 10:58:40.227 F/MOZ_Assert( 5338):
[task 2021-10-12T10:58:41.154Z] 10:58:41     INFO -  10-12 10:58:40.227 F/MOZ_Assert( 5338): #28: ???[/data/app/org.mozilla.geckoview.test-1/lib/x86_64/libxul.so +0x1c038e6]
[task 2021-10-12T10:58:41.154Z] 10:58:41     INFO -  10-12 10:58:40.227 F/MOZ_Assert( 5338):
[task 2021-10-12T10:58:41.154Z] 10:58:41     INFO -  10-12 10:58:40.227 F/MOZ_Assert( 5338): #29: ???[/data/app/org.mozilla.geckoview.test-1/lib/x86_64/libxul.so +0x122921e]
[task 2021-10-12T10:58:41.154Z] 10:58:41     INFO -  10-12 10:58:40.227 F/MOZ_Assert( 5338):
[task 2021-10-12T10:58:41.154Z] 10:58:41     INFO -  10-12 10:58:40.227 F/MOZ_Assert( 5338): #30: ???[/data/app/org.mozilla.geckoview.test-1/lib/x86_64/libxul.so +0x122d707]
[task 2021-10-12T10:58:41.154Z] 10:58:41     INFO -  10-12 10:58:40.227 F/MOZ_Assert( 5338):
[task 2021-10-12T10:58:41.154Z] 10:58:41     INFO -  10-12 10:58:40.228 F/MOZ_Assert( 5338): #31: ???[/data/app/org.mozilla.geckoview.test-1/lib/x86_64/libxul.so +0x1841059]
[task 2021-10-12T10:58:41.154Z] 10:58:41     INFO -  10-12 10:58:40.228 F/MOZ_Assert( 5338):
[task 2021-10-12T10:58:41.154Z] 10:58:41     INFO -  10-12 10:58:40.228 F/MOZ_Assert( 5338): #32: ???[/data/app/org.mozilla.geckoview.test-1/lib/x86_64/libxul.so +0x17e2a70]
[task 2021-10-12T10:58:41.154Z] 10:58:41     INFO -  10-12 10:58:40.228 F/MOZ_Assert( 5338):
[task 2021-10-12T10:58:41.154Z] 10:58:41     INFO -  10-12 10:58:40.228 F/MOZ_Assert( 5338): #33: ???[/data/app/org.mozilla.geckoview.test-1/lib/x86_64/libxul.so +0x17e29d9]
[task 2021-10-12T10:58:41.154Z] 10:58:41     INFO -  10-12 10:58:40.228 F/MOZ_Assert( 5338):
[task 2021-10-12T10:58:41.154Z] 10:58:41     INFO -  10-12 10:58:40.228 F/MOZ_Assert( 5338): #34: ???[/data/app/org.mozilla.geckoview.test-1/lib/x86_64/libxul.so +0x3c2544b]
[task 2021-10-12T10:58:41.155Z] 10:58:41     INFO -  10-12 10:58:40.228 F/MOZ_Assert( 5338):
[task 2021-10-12T10:58:41.155Z] 10:58:41     INFO -  10-12 10:58:40.228 F/MOZ_Assert( 5338): #35: ???[/data/app/org.mozilla.geckoview.test-1/lib/x86_64/libxul.so +0x4d348eb]
[task 2021-10-12T10:58:41.155Z] 10:58:41     INFO -  10-12 10:58:40.228 F/MOZ_Assert( 5338):
[task 2021-10-12T10:58:41.155Z] 10:58:41     INFO -  10-12 10:58:40.229 F/MOZ_Assert( 5338): #36: ???[/data/app/org.mozilla.geckoview.test-1/lib/x86_64/libxul.so +0x184165f]
[task 2021-10-12T10:58:41.155Z] 10:58:41     INFO -  10-12 10:58:40.229 F/MOZ_Assert( 5338):
[task 2021-10-12T10:58:41.155Z] 10:58:41     INFO -  10-12 10:58:40.229 F/MOZ_Assert( 5338): #37: ???[/data/app/org.mozilla.geckoview.test-1/lib/x86_64/libxul.so +0x17e2a70]
[task 2021-10-12T10:58:41.155Z] 10:58:41     INFO -  10-12 10:58:40.229 F/MOZ_Assert( 5338):
[task 2021-10-12T10:58:41.155Z] 10:58:41     INFO -  10-12 10:58:40.229 F/MOZ_Assert( 5338): #38: ???[/data/app/org.mozilla.geckoview.test-1/lib/x86_64/libxul.so +0x17e29d9]
[task 2021-10-12T10:58:41.155Z] 10:58:41     INFO -  10-12 10:58:40.229 F/MOZ_Assert( 5338):
[task 2021-10-12T10:58:41.155Z] 10:58:41     INFO -  10-12 10:58:40.229 F/MOZ_Assert( 5338): #39: ???[/data/app/org.mozilla.geckoview.test-1/lib/x86_64/libxul.so +0x4d343b2]
[task 2021-10-12T10:58:41.155Z] 10:58:41     INFO -  10-12 10:58:40.229 F/MOZ_Assert( 5338):
[task 2021-10-12T10:58:41.155Z] 10:58:41     INFO -  10-12 10:58:40.229 F/MOZ_Assert( 5338): #40: Java_org_mozilla_gecko_mozglue_GeckoLoader_nativeRun[/data/app/org.mozilla.geckoview.test-1/lib/x86_64/libmozglue.so +0x71491]
[task 2021-10-12T10:58:41.155Z] 10:58:41     INFO -  10-12 10:58:40.229 F/MOZ_Assert( 5338):
[task 2021-10-12T10:58:41.155Z] 10:58:41     INFO -  10-12 10:58:40.229 F/MOZ_Assert( 5338): #41: oatexec[/data/app/org.mozilla.geckoview.test-1/oat/x86_64/base.odex +0xcbef9f]
[task 2021-10-12T10:58:41.155Z] 10:58:41     INFO -  10-12 10:58:40.229 F/MOZ_Assert( 5338):
[task 2021-10-12T10:58:41.156Z] 10:58:41     INFO -  10-12 10:58:40.367 I/ActivityManager( 1651): Process org.mozilla.geckoview.test:tab36 (pid 5338) has died
[task 2021-10-12T10:58:41.156Z] 10:58:41     INFO -  10-12 10:58:40.367 D/ActivityManager( 1651): cleanUpApplicationRecord -- 5338
[task 2021-10-12T10:58:41.156Z] 10:58:41     INFO -  10-12 10:58:40.367 W/ActivityManager( 1651): Scheduling restart of crashed service org.mozilla.geckoview.test/org.mozilla.gecko.process.GeckoChildProcessServices$tab36 in 1000ms
[task 2021-10-12T10:58:41.156Z] 10:58:41     INFO -  10-12 10:58:40.367 I/Gecko   ( 3454): [Parent 3454, Unnamed thread 76cfea520780] WARNING: [1.1]: Ignoring message 'EVENT_MESSAGE' to unknown peer 5782F543C3BF4851.8CB90CA94F017A46: file /builds/worker/checkouts/gecko/ipc/glue/NodeController.cpp:289
[task 2021-10-12T10:58:41.156Z] 10:58:41     INFO -  10-12 10:58:40.367 I/Zygote  ( 1339): Process 5338 exited due to signal (11)
[task 2021-10-12T10:58:41.156Z] 10:58:41     INFO -  10-12 10:58:40.368 I/Gecko   ( 3454): [Parent 3454, Unnamed thread 76cfea520780] WARNING: [1.1]: Ignoring message 'EVENT_MESSAGE' to unknown peer 5782F543C3BF4851.8CB90CA94F017A46: file /builds/worker/checkouts/gecko/ipc/glue/NodeController.cpp:289
[task 2021-10-12T10:58:41.156Z] 10:58:41     INFO -  10-12 10:58:40.368 I/Gecko   ( 3454): [Parent 3454, Unnamed thread 76cfea520780] WARNING: [1.1]: Ignoring message 'EVENT_MESSAGE' to unknown peer 5782F543C3BF4851.8CB90CA94F017A46: file /builds/worker/checkouts/gecko/ipc/glue/NodeController.cpp:289
[task 2021-10-12T10:58:41.156Z] 10:58:41     INFO -  10-12 10:58:40.368 I/Gecko   ( 3454): [Parent 3454, Unnamed thread 76cfea520780] WARNING: [1.1]: Ignoring message 'EVENT_MESSAGE' to unknown peer 5782F543C3BF4851.8CB90CA94F017A46: file /builds/worker/checkouts/gecko/ipc/glue/NodeController.cpp:289
[task 2021-10-12T10:58:41.156Z] 10:58:41     INFO -  10-12 10:58:40.368 I/Gecko   ( 3454): [Parent 3454, Unnamed thread 76cfea520780] WARNING: [1.1]: Ignoring message 'EVENT_MESSAGE' to unknown peer 5782F543C3BF4851.8CB90CA94F017A46: file /builds/worker/checkouts/gecko/ipc/glue/NodeController.cpp:289
[task 2021-10-12T10:58:41.157Z] 10:58:41     INFO -  10-12 10:58:40.368 I/Gecko   ( 3454): [Parent 3454, Unnamed thread 76cfea520780] WARNING: [1.1]: Ignoring message 'EVENT_MESSAGE' to unknown peer 5782F543C3BF4851.8CB90CA94F017A46: file /builds/worker/checkouts/gecko/ipc/glue/NodeController.cpp:289
[task 2021-10-12T10:58:41.157Z] 10:58:41     INFO -  10-12 10:58:40.368 I/Gecko   ( 3454): [Parent 3454, Unnamed thread 76cfea520780] WARNING: [1.1]: Ignoring message 'EVENT_MESSAGE' to unknown peer 5782F543C3BF4851.8CB90CA94F017A46: file /builds/worker/checkouts/gecko/ipc/glue/NodeController.cpp:289
[task 2021-10-12T10:58:41.157Z] 10:58:41     INFO -  10-12 10:58:40.368 I/Gecko   ( 3454): [Parent 3454, Unnamed thread 76cfea520780] WARNING: [1.1]: Ignoring message 'EVENT_MESSAGE' to unknown peer 5782F543C3BF4851.8CB90CA94F017A46: file /builds/worker/checkouts/gecko/ipc/glue/NodeController.cpp:289
[task 2021-10-12T10:58:41.157Z] 10:58:41     INFO -  10-12 10:58:40.368 I/Gecko   ( 3454): [Parent 3454, Unnamed thread 76cfea520780] WARNING: [1.1]: Ignoring message 'EVENT_MESSAGE' to unknown peer 5782F543C3BF4851.8CB90CA94F017A46: file /builds/worker/checkouts/gecko/ipc/glue/NodeController.cpp:289
[task 2021-10-12T10:58:41.157Z] 10:58:41     INFO -  10-12 10:58:40.368 I/Gecko   ( 3454): [Parent 3454, Unnamed thread 76cfea520780] WARNING: [1.1]: Ignoring message 'EVENT_MESSAGE' to unknown peer 5782F543C3BF4851.8CB90CA94F017A46: file /builds/worker/checkouts/gecko/ipc/glue/NodeController.cpp:289
[task 2021-10-12T10:58:41.157Z] 10:58:41     INFO -  10-12 10:58:40.368 I/Gecko   ( 3454): [Parent 3454, Unnamed thread 76cfea520780] WARNING: [1.1]: Ignoring message 'EVENT_MESSAGE' to unknown peer 5782F543C3BF4851.8CB90CA94F017A46: file /builds/worker/checkouts/gecko/ipc/glue/NodeController.cpp:289
[task 2021-10-12T10:58:41.157Z] 10:58:41     INFO -  10-12 10:58:40.374 I/Gecko   ( 3454):
[task 2021-10-12T10:58:41.158Z] 10:58:41     INFO -  10-12 10:58:40.374 I/Gecko   ( 3454): ###!!! [Parent][MessageChannel] Error: (msgtype=0x2300A2,name=PBrowser::Msg_Destroy) Channel error: cannot send/recv
[task 2021-10-12T10:58:41.158Z] 10:58:41     INFO -  10-12 10:58:40.374 I/Gecko   ( 3454):
[task 2021-10-12T10:58:41.158Z] 10:58:41     INFO -  10-12 10:58:40.375 D/GeckoViewProgress( 3454): observe: topic=oop-frameloader-crashed
[task 2021-10-12T10:58:41.158Z] 10:58:41     INFO -  10-12 10:58:40.375 D/GeckoViewContent( 3454): observe: oop-frameloader-crashed
[task 2021-10-12T10:58:41.158Z] 10:58:41     INFO -  10-12 10:58:40.375 D/GeckoViewProgress( 3454): observe: topic=oop-frameloader-crashed
[task 2021-10-12T10:58:41.158Z] 10:58:41     INFO -  10-12 10:58:40.375 D/GeckoViewProgress( 3454): ProgressTracker stop
[task 2021-10-12T10:58:41.158Z] 10:58:41     INFO -  10-12 10:58:40.375 D/GeckoViewContent( 3454): observe: oop-frameloader-crashed
[task 2021-10-12T10:58:41.158Z] 10:58:41     INFO -  10-12 10:58:40.375 I/Gecko   ( 3454): [Parent 3454, Main Thread] WARNING: No build ID mismatch: file /builds/worker/checkouts/gecko/dom/base/nsFrameLoader.cpp:3827
[task 2021-10-12T10:58:41.158Z] 10:58:41     INFO -  10-12 10:58:40.376 I/Gecko   ( 3454): [Parent 3454, Main Thread] WARNING: IPC message discarded: actor cannot send: file /builds/worker/checkouts/gecko/ipc/glue/ProtocolUtils.cpp:527
[task 2021-10-12T10:58:41.158Z] 10:58:41     INFO -  10-12 10:58:40.376 I/Gecko   ( 3454): [Parent 3454, Main Thread] WARNING: IPC message discarded: actor cannot send: file /builds/worker/checkouts/gecko/ipc/glue/ProtocolUtils.cpp:527
[task 2021-10-12T10:58:41.158Z] 10:58:41     INFO -  10-12 10:58:40.377 D/GeckoViewProgress( 3454): observe: topic=oop-frameloader-crashed
[task 2021-10-12T10:58:41.158Z] 10:58:41     INFO -  10-12 10:58:40.377 D/GeckoViewProgress( 3454): ProgressTracker stop
[task 2021-10-12T10:58:41.158Z] 10:58:41     INFO -  10-12 10:58:40.377 D/GeckoViewContent( 3454): observe: oop-frameloader-crashed
[task 2021-10-12T10:58:41.158Z] 10:58:41     INFO -  10-12 10:58:40.377 D/GeckoViewProgress( 3454): observe: topic=oop-frameloader-crashed
[task 2021-10-12T10:58:41.159Z] 10:58:41     INFO -  10-12 10:58:40.377 D/GeckoViewContent( 3454): observe: oop-frameloader-crashed
[task 2021-10-12T10:58:41.159Z] 10:58:41     INFO -  10-12 10:58:40.377 I/Gecko   ( 3454): [Parent 3454, Main Thread] WARNING: No build ID mismatch: file /builds/worker/checkouts/gecko/dom/base/nsFrameLoader.cpp:3827
[task 2021-10-12T10:58:41.159Z] 10:58:41     INFO -  10-12 10:58:40.379 D/GeckoViewContent( 3454): observe: ipc:content-shutdown
[task 2021-10-12T10:58:41.159Z] 10:58:41     INFO -  10-12 10:58:40.380 D/GeckoViewContent( 3454): observe: ipc:content-shutdown
[task 2021-10-12T10:58:41.159Z] 10:58:41     INFO -  10-12 10:58:40.380 D/GeckoViewContentCrashHandler( 3454): Notifying content process crash, dump ID 73583e81-cd27-b7bb-ae70-c665f02f1264
[task 2021-10-12T10:58:41.159Z] 10:58:41     INFO -  10-12 10:58:40.382 I/Gecko   ( 3454): [Parent 3454, Unnamed thread 76cfea520780] WARNING: waitpid failed pid:5338 errno:10: file /builds/worker/checkouts/gecko/ipc/chromium/src/base/process_util_posix.cc:238
[task 2021-10-12T10:58:41.159Z] 10:58:41     INFO -  10-12 10:58:40.388 I/art     ( 5378): Late-enabling -Xcheck:jni
[task 2021-10-12T10:58:41.159Z] 10:58:41     INFO -  10-12 10:58:40.388 W/art     ( 5378): Unexpected CPU variant for X86 using defaults: x86_64
[task 2021-10-12T10:58:41.159Z] 10:58:41     INFO -  10-12 10:58:40.392 I/ActivityManager( 1651): Start proc 5378:org.mozilla.geckoview.test:crash/u0a62 for service org.mozilla.geckoview.test/.TestCrashHandler
[task 2021-10-12T10:58:41.159Z] 10:58:41     INFO -  10-12 10:58:40.406 W/GeckoConsole( 3454): [JavaScript Warning: "telemetry.state_file_read_errors - Unknown scalar."]
[task 2021-10-12T10:58:41.159Z] 10:58:41     INFO -  10-12 10:58:40.407 W/GeckoConsole( 3454): [JavaScript Warning: "telemetry.generated_new_client_id - Unknown scalar."]
[task 2021-10-12T10:58:41.159Z] 10:58:41     INFO -  10-12 10:58:40.409 I/MultiDex( 5378): VM with version 2.1.0 has multidex support
[task 2021-10-12T10:58:41.160Z] 10:58:41     INFO -  10-12 10:58:40.409 I/MultiDex( 5378): Installing application
[task 2021-10-12T10:58:41.160Z] 10:58:41     INFO -  10-12 10:58:40.409 I/MultiDex( 5378): VM has multidex support, MultiDex support library is disabled.
[task 2021-10-12T10:58:41.160Z] 10:58:41     INFO -  10-12 10:58:40.411 I/art     ( 5378): System.exit called, status: 0
[task 2021-10-12T10:58:41.160Z] 10:58:41     INFO -  10-12 10:58:40.411 I/AndroidRuntime( 5378): VM exiting with result code 0, cleanup skipped.
[task 2021-10-12T10:58:41.160Z] 10:58:41     INFO -  10-12 10:58:40.442 I/BackgroundThrea( 3454): type=1400 audit(0.0:16): avc: denied { read } for name="lock" dev="vdc" ino=168972 scontext=u:r:untrusted_app:s0:c512,c768 tcontext=u:object_r:shell_data_file:s0:c512,c768 tclass=lnk_file permissive=1
[task 2021-10-12T10:58:41.160Z] 10:58:41     INFO -  10-12 10:58:40.442 I/BackgroundThrea( 3454): type=1400 audit(0.0:17): avc: denied { getattr } for path="/data/local/tmp/test_root/junit-profile/lock" dev="vdc" ino=168972 scontext=u:r:untrusted_app:s0:c512,c768 tcontext=u:object_r:shell_data_file:s0:c512,c768 tclass=lnk_file permissive=1
[task 2021-10-12T10:58:41.160Z] 10:58:41     INFO -  10-12 10:58:40.467 I/ActivityManager( 1651): Process org.mozilla.geckoview.test:crash (pid 5378) has died
[task 2021-10-12T10:58:41.160Z] 10:58:41     INFO -  10-12 10:58:40.467 D/ActivityManager( 1651): cleanUpApplicationRecord -- 5378
[task 2021-10-12T10:58:41.160Z] 10:58:41     INFO -  10-12 10:58:40.467 W/ActivityManager( 1651): Scheduling restart of crashed service org.mozilla.geckoview.test/.TestCrashHandler in 1000ms
[task 2021-10-12T10:58:41.160Z] 10:58:41     INFO -  10-12 10:58:40.627 E/SystemStateListener( 3454): mInputManager should be valid!
[task 2021-10-12T10:58:41.160Z] 10:58:41     INFO -  10-12 10:58:40.628 D/GeckoViewContent( 3454): handleEvent: DOMWindowClose
[task 2021-10-12T10:58:41.160Z] 10:58:41     INFO -  10-12 10:58:40.628 E/GeckoSessionTestRule( 3454): Error
[task 2021-10-12T10:58:41.161Z] 10:58:41     INFO -  10-12 10:58:40.628 E/GeckoSessionTestRule( 3454): org.mozilla.geckoview.test.rule.GeckoSessionTestRule$ChildCrashedException: Child process crashed
[task 2021-10-12T10:58:41.161Z] 10:58:41     INFO -  10-12 10:58:40.628 E/GeckoSessionTestRule( 3454): 	at org.mozilla.geckoview.test.rule.GeckoSessionTestRule$1.invoke(GeckoSessionTestRule.java:1172)
[task 2021-10-12T10:58:41.161Z] 10:58:41     INFO -  10-12 10:58:40.628 E/GeckoSessionTestRule( 3454): 	at java.lang.reflect.Proxy.invoke(Proxy.java:813)
[task 2021-10-12T10:58:41.161Z] 10:58:41     INFO -  10-12 10:58:40.628 E/GeckoSessionTestRule( 3454): 	at $Proxy22.onCrash(Unknown Source)
[task 2021-10-12T10:58:41.161Z] 10:58:41     INFO -  10-12 10:58:40.628 E/GeckoSessionTestRule( 3454): 	at org.mozilla.geckoview.GeckoSession$2.handleMessage(GeckoSession.java:389)
[task 2021-10-12T10:58:41.161Z] 10:58:41     INFO -  10-12 10:58:40.628 E/GeckoSessionTestRule( 3454): 	at org.mozilla.geckoview.GeckoSession$2.handleMessage(GeckoSession.java:380)
[task 2021-10-12T10:58:41.161Z] 10:58:41     INFO -  10-12 10:58:40.628 E/GeckoSessionTestRule( 3454): 	at org.mozilla.geckoview.GeckoSessionHandler.handleMessage(GeckoSessionHandler.java:88)
[task 2021-10-12T10:58:41.161Z] 10:58:41     INFO -  10-12 10:58:40.628 E/GeckoSessionTestRule( 3454): 	at org.mozilla.gecko.EventDispatcher$3.run(EventDispatcher.java:426)
[task 2021-10-12T10:58:41.161Z] 10:58:41     INFO -  10-12 10:58:40.628 E/GeckoSessionTestRule( 3454): 	at android.os.Handler.handleCallback(Handler.java:751)
[task 2021-10-12T10:58:41.161Z] 10:58:41     INFO -  10-12 10:58:40.628 E/GeckoSessionTestRule( 3454): 	at android.os.Handler.dispatchMessage(Handler.java:95)
[task 2021-10-12T10:58:41.161Z] 10:58:41     INFO -  10-12 10:58:40.628 E/GeckoSessionTestRule( 3454): 	at org.mozilla.geckoview.test.util.UiThreadUtils.waitForCondition(UiThreadUtils.java:158)
[task 2021-10-12T10:58:41.161Z] 10:58:41     INFO -  10-12 10:58:40.628 E/GeckoSessionTestRule( 3454): 	at org.mozilla.geckoview.test.rule.GeckoSessionTestRule.waitForMessage(GeckoSessionTestRule.java:2140)
[task 2021-10-12T10:58:41.162Z] 10:58:41     INFO -  10-12 10:58:40.628 E/GeckoSessionTestRule( 3454): 	at org.mozilla.geckoview.test.rule.GeckoSessionTestRule.evaluateJS(GeckoSessionTestRule.java:2101)
[task 2021-10-12T10:58:41.162Z] 10:58:41     INFO -  10-12 10:58:40.628 E/GeckoSessionTestRule( 3454): 	at org.mozilla.geckoview.test.BaseSessionTest.evaluateJS(BaseSessionTest.kt:195)
[task 2021-10-12T10:58:41.162Z] 10:58:41     INFO -  10-12 10:58:40.628 E/GeckoSessionTestRule( 3454): 	at org.mozilla.geckoview.test.AutocompleteTest.creditCardUpdateAccept(AutocompleteTest.kt:1036)
[task 2021-10-12T10:58:41.162Z] 10:58:41     INFO -  10-12 10:58:40.628 E/GeckoSessionTestRule( 3454): 	at java.lang.reflect.Method.invoke(Native Method)
[task 2021-10-12T10:58:41.162Z] 10:58:41     INFO -  10-12 10:58:40.628 E/GeckoSessionTestRule( 3454): 	at org.junit.runners.model.FrameworkMethod$1.runReflectiveCall(FrameworkMethod.java:50)
[task 2021-10-12T10:58:41.162Z] 10:58:41     INFO -  10-12 10:58:40.628 E/GeckoSessionTestRule( 3454): 	at org.junit.internal.runners.model.ReflectiveCallable.run(ReflectiveCallable.java:12)
[task 2021-10-12T10:58:41.162Z] 10:58:41     INFO -  10-12 10:58:40.628 E/GeckoSessionTestRule( 3454): 	at org.junit.runners.model.FrameworkMethod.invokeExplosively(FrameworkMethod.java:47)
[task 2021-10-12T10:58:41.162Z] 10:58:41     INFO -  10-12 10:58:40.628 E/GeckoSessionTestRule( 3454): 	at org.junit.internal.runners.statements.InvokeMethod.evaluate(InvokeMethod.java:17)
[task 2021-10-12T10:58:41.162Z] 10:58:41     INFO -  10-12 10:58:40.628 E/GeckoSessionTestRule( 3454): 	at org.mozilla.geckoview.test.rule.GeckoSessionTestRule$2.lambda$evaluate$0$GeckoSessionTestRule$2(GeckoSessionTestRule.java:1441)
[task 2021-10-12T10:58:41.162Z] 10:58:41     INFO -  10-12 10:58:40.628 E/GeckoSessionTestRule( 3454): 	at org.mozilla.geckoview.test.rule.-$$Lambda$GeckoSessionTestRule$2$TNUWVrkQlCzXHIjIbcLih1Q8TRE.run(lambda)
[task 2021-10-12T10:58:41.163Z] 10:58:41     INFO -  10-12 10:58:40.628 E/GeckoSessionTestRule( 3454): 	at android.app.Instrumentation$SyncRunnable.run(Instrumentation.java:1950)
[task 2021-10-12T10:58:41.163Z] 10:58:41     INFO -  10-12 10:58:40.628 E/GeckoSessionTestRule( 3454): 	at android.os.Handler.handleCallback(Handler.java:751)
[task 2021-10-12T10:58:41.163Z] 10:58:41     INFO -  10-12 10:58:40.628 E/GeckoSessionTestRule( 3454): 	at android.os.Handler.dispatchMessage(Handler.java:95)
[task 2021-10-12T10:58:41.163Z] 10:58:41     INFO -  10-12 10:58:40.628 E/GeckoSessionTestRule( 3454): 	at android.os.Looper.loop(Looper.java:154)
[task 2021-10-12T10:58:41.163Z] 10:58:41     INFO -  10-12 10:58:40.628 E/GeckoSessionTestRule( 3454): 	at android.app.ActivityThread.main(ActivityThread.java:6077)
[task 2021-10-12T10:58:41.163Z] 10:58:41     INFO -  10-12 10:58:40.628 E/GeckoSessionTestRule( 3454): 	at java.lang.reflect.Method.invoke(Native Method)
[task 2021-10-12T10:58:41.163Z] 10:58:41     INFO -  10-12 10:58:40.628 E/GeckoSessionTestRule( 3454): 	at com.android.internal.os.ZygoteInit$MethodAndArgsCaller.run(ZygoteInit.java:866)
[task 2021-10-12T10:58:41.163Z] 10:58:41     INFO -  10-12 10:58:40.628 E/GeckoSessionTestRule( 3454): 	at com.android.internal.os.ZygoteInit.main(ZygoteInit.java:756)
[task 2021-10-12T10:58:41.163Z] 10:58:41     INFO -  10-12 10:58:40.628 D/GeckoViewNavigation( 3454): canClose
[task 2021-10-12T10:58:41.163Z] 10:58:41     INFO -  10-12 10:58:40.629 D/GeckoViewNavigation( 3454): canClose
[task 2021-10-12T10:58:41.163Z] 10:58:41     INFO -  10-12 10:58:40.644 D/GeckoViewSelectionActionDelegate[C]( 3454): handleEvent: visibilitychange
[task 2021-10-12T10:58:41.163Z] 10:58:41     INFO -  10-12 10:58:40.647 D/GeckoViewAutoFill[C]( 3454): handleEvent: pagehide
[task 2021-10-12T10:58:41.163Z] 10:58:41     INFO -  10-12 10:58:40.649 D/GeckoViewAutofill( 3454): Clearing auto-fill
[task 2021-10-12T10:58:41.164Z] 10:58:41     INFO -  10-12 10:58:40.649 E/GeckoConsole( 3454): [JavaScript Error: "TypeError: can't access property "sendRequest", this._eventDispatcher is null" {file: "resource://gre/modules/GeckoViewAutofill.jsm" line: 323}]
[task 2021-10-12T10:58:41.164Z] 10:58:41     INFO -  10-12 10:58:40.649 E/GeckoConsole( 3454): clearElements@resource://gre/modules/GeckoViewAutofill.jsm:323:5
[task 2021-10-12T10:58:41.164Z] 10:58:41     INFO -  10-12 10:58:40.649 E/GeckoConsole( 3454): handleEvent@resource:///actors/GeckoViewAutoFillChild.jsm:65:26
[task 2021-10-12T10:58:41.164Z] 10:58:41     INFO -  10-12 10:58:40.649 E/GeckoConsole( 3454): _releaseBrowser@resource://gre/modules/ExtensionParent.jsm:1299:18
[task 2021-10-12T10:58:41.164Z] 10:58:41     INFO -  10-12 10:58:40.649 E/GeckoConsole( 3454): shutdown@resource://gre/modules/ExtensionParent.jsm:1294:12
[task 2021-10-12T10:58:41.164Z] 10:58:41     INFO -  10-12 10:58:40.649 E/GeckoConsole( 3454): shutdown@chrome://extensions/content/parent/ext-backgroundPage.js:107:11
[task 2021-10-12T10:58:41.164Z] 10:58:41     INFO -  10-12 10:58:40.649 E/GeckoConsole( 3454): onShutdown@chrome://extensions/content/parent/ext-backgroundPage.js:309:23
[task 2021-10-12T10:58:41.164Z] 10:58:41     INFO -  10-12 10:58:40.649 E/GeckoConsole( 3454): ExtensionAPI/<@resource://gre/modules/ExtensionCommon.jsm:358:14
[task 2021-10-12T10:58:41.164Z] 10:58:41     INFO -  10-12 10:58:40.649 E/GeckoConsole( 3454): wrapper@resource://gre/modules/ExtensionCommon.jsm:302:14
[task 2021-10-12T10:58:41.164Z] 10:58:41     INFO -  10-12 10:58:40.649 E/GeckoConsole( 3454): emit@resource://gre/modules/ExtensionCommon.jsm:329:32
[task 2021-10-12T10:58:41.164Z] 10:58:41     INFO -  10-12 10:58:40.649 E/GeckoConsole( 3454): emit@resource://gre/modules/Extension.jsm:2156:25
[task 2021-10-12T10:58:41.164Z] 10:58:41     INFO -  10-12 10:58:40.649 E/GeckoConsole( 3454): shutdown@resource://gre/modules/Extension.jsm:2872:10
[task 2021-10-12T10:58:41.164Z] 10:58:41     INFO -  10-12 10:58:40.649 E/GeckoConsole( 3454): shutdown@resource://gre/modules/Extension.jsm:1903:39
[task 2021-10-12T10:58:41.165Z] 10:58:41     INFO -  10-12 10:58:40.649 E/GeckoConsole( 3454): callBootstrapMethod@resource://gre/modules/addons/XPIProvider.jsm:1834:33
[task 2021-10-12T10:58:41.165Z] 10:58:41     INFO -  10-12 10:58:40.649 E/GeckoConsole( 3454): _shutdown@resource://gre/modules/addons/XPIP
[task 2021-10-12T10:58:41.165Z] 10:58:41     INFO -  10-12 10:58:40.658 D/GeckoViewContent( 3454): handleEvent: DOMWindowClose
[task 2021-10-12T10:58:41.165Z] 10:58:41     INFO -  10-12 10:58:40.660 D/GeckoThread( 3454): State changed to EXITING
[task 2021-10-12T10:58:41.165Z] 10:58:41     INFO -  10-12 10:58:40.660 W/GeckoSession( 3454): Attempted to close a GeckoSession that was already closed.
[task 2021-10-12T10:58:41.165Z] 10:58:41     INFO -  10-12 10:58:40.660 I/Gecko   ( 3454): nsWindow[0x76cfcfda3c00]::Show 0
[task 2021-10-12T10:58:41.165Z] 10:58:41     INFO -  10-12 10:58:40.660 E/SystemStateListener( 3454): mInputManager should be valid!
[task 2021-10-12T10:58:41.165Z] 10:58:41     INFO -  10-12 10:58:40.661 E/GeckoSessionTestRule( 3454): test_end c5ee677f-bc83-49bd-9e28-2d35f3d0f059 creditCardUpdateAccept(org.mozilla.geckoview.test.AutocompleteTest)
[task 2021-10-12T10:58:41.165Z] 10:58:41  WARNING -  TEST-UNEXPECTED-FAIL | org.mozilla.geckoview.test.AutocompleteTest#creditCardUpdateAccept | org.mozilla.geckoview.test.rule.GeckoSessionTestRule$ChildCrashedException: Child process crashed
[task 2021-10-12T10:58:41.166Z] 10:58:41     INFO -  TEST-INFO took 1920ms
[task 2021-10-12T10:58:41.166Z] 10:58:41     INFO -  org.mozilla.geckoview.test | INSTRUMENTATION_STATUS: numtests=808
[task 2021-10-12T10:58:41.166Z] 10:58:41     INFO -  org.mozilla.geckoview.test | INSTRUMENTATION_STATUS: stream=
[task 2021-10-12T10:58:41.166Z] 10:58:41     INFO -  org.mozilla.geckoview.test | INSTRUMENTATION_STATUS: id=AndroidJUnitRunner
[task 2021-10-12T10:58:41.166Z] 10:58:41     INFO -  org.mozilla.geckoview.test | INSTRUMENTATION_STATUS: test=loginSaveDismiss
[task 2021-10-12T10:58:41.166Z] 10:58:41     INFO -  org.mozilla.geckoview.test | INSTRUMENTATION_STATUS: class=org.mozilla.geckoview.test.AutocompleteTest
[task 2021-10-12T10:58:41.166Z] 10:58:41     INFO -  org.mozilla.geckoview.test | INSTRUMENTATION_STATUS: current=46
[task 2021-10-12T10:58:41.166Z] 10:58:41     INFO -  org.mozilla.geckoview.test | INSTRUMENTATION_STATUS_CODE: 1
[task 2021-10-12T10:58:41.166Z] 10:58:41     INFO -  TEST-START | org.mozilla.geckoview.test.AutocompleteTest#loginSaveDismiss
[task 2021-10-12T10:59:41.046Z] 10:59:41     INFO -  org.mozilla.geckoview.test | INSTRUMENTATION_STATUS: numtests=808
[task 2021-10-12T10:59:41.046Z] 10:59:41     INFO -  org.mozilla.geckoview.test | INSTRUMENTATION_STATUS: stream=
[task 2021-10-12T10:59:41.046Z] 10:59:41     INFO -  org.mozilla.geckoview.test | Error in loginSaveDismiss(org.mozilla.geckoview.test.AutocompleteTest):
[task 2021-10-12T10:59:41.047Z] 10:59:41     INFO -  org.mozilla.geckoview.test | org.mozilla.geckoview.test.rule.TestHarnessException: org.mozilla.geckoview.test.util.UiThreadUtils$TimeoutException: Timed out after 30000ms
[task 2021-10-12T10:59:41.047Z] 10:59:41     INFO -  org.mozilla.geckoview.test | 	at org.mozilla.geckoview.test.rule.GeckoSessionTestRule$2.initTest(GeckoSessionTestRule.java:1427)
[task 2021-10-12T10:59:41.047Z] 10:59:41     INFO -  org.mozilla.geckoview.test | 	at org.mozilla.geckoview.test.rule.GeckoSessionTestRule$2.lambda$evaluate$0$GeckoSessionTestRule$2(GeckoSessionTestRule.java:1440)
[task 2021-10-12T10:59:41.047Z] 10:59:41     INFO -  org.mozilla.geckoview.test | 	at org.mozilla.geckoview.test.rule.-$$Lambda$GeckoSessionTestRule$2$TNUWVrkQlCzXHIjIbcLih1Q8TRE.run(lambda)
[task 2021-10-12T10:59:41.048Z] 10:59:41     INFO -  org.mozilla.geckoview.test | 	at android.app.Instrumentation$SyncRunnable.run(Instrumentation.java:1950)
[task 2021-10-12T10:59:41.048Z] 10:59:41     INFO -  org.mozilla.geckoview.test | 	at android.os.Handler.handleCallback(Handler.java:751)
[task 2021-10-12T10:59:41.048Z] 10:59:41     INFO -  org.mozilla.geckoview.test | 	at android.os.Handler.dispatchMessage(Handler.java:95)
[task 2021-10-12T10:59:41.048Z] 10:59:41     INFO -  org.mozilla.geckoview.test | 	at android.os.Looper.loop(Looper.java:154)
[task 2021-10-12T10:59:41.048Z] 10:59:41     INFO -  org.mozilla.geckoview.test | 	at android.app.ActivityThread.main(ActivityThread.java:6077)
[task 2021-10-12T10:59:41.048Z] 10:59:41     INFO -  org.mozilla.geckoview.test | 	at java.lang.reflect.Method.invoke(Native Method)
[task 2021-10-12T10:59:41.049Z] 10:59:41     INFO -  org.mozilla.geckoview.test | 	at com.android.internal.os.ZygoteInit$MethodAndArgsCaller.run(ZygoteInit.java:866)
[task 2021-10-12T10:59:41.049Z] 10:59:41     INFO -  org.mozilla.geckoview.test | 	at com.android.internal.os.ZygoteInit.main(ZygoteInit.java:756)
[task 2021-10-12T10:59:41.049Z] 10:59:41     INFO -  org.mozilla.geckoview.test | Caused by: org.mozilla.geckoview.test.util.UiThreadUtils$TimeoutException: Timed out after 30000ms
[task 2021-10-12T10:59:41.049Z] 10:59:41     INFO -  org.mozilla.geckoview.test | 	at org.mozilla.geckoview.test.util.UiThreadUtils$TimeoutRunnable.run(UiThreadUtils.java:49)
[task 2021-10-12T10:59:41.049Z] 10:59:41     INFO -  org.mozilla.geckoview.test | 	at android.os.Handler.handleCallback(Handler.java:751)
[task 2021-10-12T10:59:41.050Z] 10:59:41     INFO -  org.mozilla.geckoview.test | 	at android.os.Handler.dispatchMessage(Handler.java:95)
[task 2021-10-12T10:59:41.050Z] 10:59:41     INFO -  org.mozilla.geckoview.test | 	at org.mozilla.geckoview.test.util.UiThreadUtils.waitForCondition(UiThreadUtils.java:158)
[task 2021-10-12T10:59:41.050Z] 10:59:41     INFO -  org.mozilla.geckoview.test | 	at org.mozilla.geckoview.test.rule.GeckoSessionTestRule.openSession(GeckoSessionTestRule.java:1287)
[task 2021-10-12T10:59:41.050Z] 10:59:41     INFO -  org.mozilla.geckoview.test | 	at org.mozilla.geckoview.test.rule.GeckoSessionTestRule.prepareStatement(GeckoSessionTestRule.java:1221)
[task 2021-10-12T10:59:41.051Z] 10:59:41     INFO -  org.mozilla.geckoview.test | 	at org.mozilla.geckoview.test.rule.GeckoSessionTestRule$2.initTest(GeckoSessionTestRule.java:1423)
[task 2021-10-12T10:59:41.051Z] 10:59:41     INFO -  org.mozilla.geckoview.test | 	... 10 more
[task 2021-10-12T10:59:41.051Z] 10:59:41     INFO -  org.mozilla.geckoview.test |
[task 2021-10-12T10:59:41.051Z] 10:59:41     INFO -  org.mozilla.geckoview.test | INSTRUMENTATION_STATUS: id=AndroidJUnitRunner
[task 2021-10-12T10:59:41.051Z] 10:59:41     INFO -  org.mozilla.geckoview.test | INSTRUMENTATION_STATUS: test=loginSaveDismiss
[task 2021-10-12T10:59:41.051Z] 10:59:41     INFO -  org.mozilla.geckoview.test | INSTRUMENTATION_STATUS: class=org.mozilla.geckoview.test.AutocompleteTest
[task 2021-10-12T10:59:41.052Z] 10:59:41     INFO -  org.mozilla.geckoview.test | INSTRUMENTATION_STATUS: stack=org.mozilla.geckoview.test.rule.TestHarnessException: org.mozilla.geckoview.test.util.UiThreadUtils$TimeoutException: Timed out after 30000ms
[task 2021-10-12T10:59:41.052Z] 10:59:41     INFO -  SUITE-END | took 116s
[task 2021-10-12T10:59:41.052Z] 10:59:41  WARNING -  TEST-UNEXPECTED-FAIL | runjunit.py | The previous test failed because of an error in the test harness | org.mozilla.geckoview.test.rule.TestHarnessException: org.mozilla.geckoview.test.util.UiThreadUtils$TimeoutException: Timed out after 30000ms
[task 2021-10-12T10:59:41.052Z] 10:59:41     INFO -  Stopping web server
[task 2021-10-12T10:59:41.064Z] 10:59:41     INFO -  Server shut down.
[task 2021-10-12T10:59:41.085Z] 10:59:41     INFO -  Web server killed.
[task 2021-10-12T10:59:41.085Z] 10:59:41     INFO -  Stopping web socket server
[task 2021-10-12T10:59:41.105Z] 10:59:41     INFO -  Stopping ssltunnel
[task 2021-10-12T10:59:41.542Z] 10:59:41    ERROR - Return code: 255
[task 2021-10-12T10:59:41.543Z] 10:59:41    ERROR - No tests run or test summary not found
[task 2021-10-12T10:59:41.543Z] 10:59:41     INFO - TinderboxPrint: geckoview-junit<br/><em class="testfail">T-FAIL</em>
[task 2021-10-12T10:59:41.543Z] 10:59:41     INFO - ##### geckoview-junit log ends
[task 2021-10-12T10:59:41.544Z] 10:59:41  WARNING - # TBPL WARNING #
[task 2021-10-12T10:59:41.544Z] 10:59:41  WARNING - setting return code to 1

:owlish are you still working on this?

Flags: needinfo?(bugzeeeeee)
Whiteboard: [geckoview:m95] → [geckoview:m95][stockwell needswork:owner]

yes, I am!

Flags: needinfo?(bugzeeeeee)
Whiteboard: [geckoview:m95][stockwell disable-recommended] → [geckoview:m95][stockwell needswork:owner]
Whiteboard: [geckoview:m95][stockwell disable-recommended] → [geckoview:m95][stockwell needswork:owner]
Pushed by istorozhko@mozilla.com:
https://hg.mozilla.org/integration/autoland/rev/5838e5081f71
Make sure autocomplete search is initialized with a value r=geckoview-reviewers,agi
Status: NEW → RESOLVED
Closed: 2 months ago
Resolution: --- → FIXED
Target Milestone: --- → 95 Branch
See Also: → 1738980
You need to log in before you can comment on or make changes to this bug.