Closed Bug 1755233 Opened 4 years ago Closed 4 years ago

Intermittent mozmake[3]: *** [backend.mk:1234: devtools/client/debugger/src/client/.deps/node.stub.stub] Error 1

Categories

(Firefox Build System :: General, defect, P5)

defect

Tracking

(Not tracked)

RESOLVED INCOMPLETE

People

(Reporter: intermittent-bug-filer, Unassigned)

Details

(Keywords: intermittent-failure)

Filed by: ccozmuta [at] mozilla.com
Parsed log: https://treeherder.mozilla.org/logviewer?job_id=367764603&repo=autoland
Full log: https://firefox-ci-tc.services.mozilla.com/api/queue/v1/task/S67L5VqRRrG7ip1yU4eaGw/runs/0/artifacts/public/logs/live_backing.log


[task 2022-02-14T05:37:08.842Z] 05:37:08    ERROR -  mozmake[3]: *** [backend.mk:1234: devtools/client/debugger/src/client/.deps/node.stub.stub] Error 1
[task 2022-02-14T05:37:08.842Z] 05:37:08     INFO -  mozmake[3]: Leaving directory 'z:/task_164481320939806/workspace/obj-build'
[task 2022-02-14T05:37:08.842Z] 05:37:08     INFO -  mozmake[3]: *** Waiting for unfinished jobs....
[task 2022-02-14T05:37:09.079Z] 05:37:09     INFO -  mozmake[4]: Entering directory 'z:/task_164481320939806/workspace/obj-build/toolkit/locales'
[task 2022-02-14T05:37:09.079Z] 05:37:09     INFO -  toolkit/locales/defaultagent_localized.ini.stub
<...>
[task 2022-02-14T05:37:17.280Z] 05:37:17    ERROR -  mozmake[2]: *** [Z:/task_164481320939806/build/src/config/recurse.mk:34: misc] Error 2
[task 2022-02-14T05:37:17.280Z] 05:37:17    ERROR -  mozmake[1]: *** [Z:/task_164481320939806/build/src/config/rules.mk:352: default] Error 2
[task 2022-02-14T05:37:17.280Z] 05:37:17     INFO -  mozmake: *** [client.mk:63: build] Error 2
[task 2022-02-14T05:37:17.313Z] 05:37:17     INFO -  291 compiler warnings present.
[task 2022-02-14T05:37:17.501Z] 05:37:17     INFO -  --priority not supported on this platform.
[task 2022-02-14T05:37:17.514Z] 05:37:17     INFO -   Config object not found by mach.
[task 2022-02-14T05:37:17.514Z] 05:37:17     INFO -  Configure complete!
[task 2022-02-14T05:37:17.514Z] 05:37:17     INFO -  Be sure to run |mach build| to pick up any changes
[task 2022-02-14T05:37:17.579Z] 05:37:17    ERROR - Return code: 2
[task 2022-02-14T05:37:17.579Z] 05:37:17  WARNING - setting return code to 2
[task 2022-02-14T05:37:17.579Z] 05:37:17    FATAL - 'mach build -v' did not run successfully. Please check log for errors.
[task 2022-02-14T05:37:17.580Z] 05:37:17    FATAL - Running post_fatal callback...
[task 2022-02-14T05:37:17.580Z] 05:37:17    FATAL - Exiting -1
[task 2022-02-14T05:37:17.580Z] 05:37:17     INFO - [mozharness: 2022-02-14 05:37:17.580169Z] Finished build step (failed)
Status: NEW → RESOLVED
Closed: 4 years ago
Resolution: --- → INCOMPLETE
You need to log in before you can comment on or make changes to this bug.