Closed Bug 1835573 Opened 3 years ago Closed 10 months ago

Intermittent org.mozilla.geckoview.test.PrintDelegateTest#iframeWindowDotPrintTest | single tracking bug

Categories

(GeckoView :: General, defect, P5)

All
Android
defect

Tracking

(Not tracked)

RESOLVED INCOMPLETE

People

(Reporter: intermittent-bug-filer, Unassigned)

Details

(Keywords: intermittent-failure, intermittent-testcase)

Filed by: imoraru [at] mozilla.com
Parsed log: https://treeherder.mozilla.org/logviewer?job_id=417347143&repo=autoland
Full log: https://firefox-ci-tc.services.mozilla.com/api/queue/v1/task/I7IywcGbSxyYq-iICfmEHg/runs/0/artifacts/public/logs/live_backing.log


[task 2023-05-28T23:30:34.799Z] 23:30:34     INFO -  TEST-START | org.mozilla.geckoview.test.PrintDelegateTest#iframeWindowDotPrintTest
[task 2023-05-28T23:31:07.679Z] 23:31:07     INFO -  org.mozilla.geckoview.test | INSTRUMENTATION_STATUS: numtests=1032
[task 2023-05-28T23:31:07.679Z] 23:31:07     INFO -  org.mozilla.geckoview.test | INSTRUMENTATION_STATUS: stream=
[task 2023-05-28T23:31:07.680Z] 23:31:07     INFO -  org.mozilla.geckoview.test | Error in iframeWindowDotPrintTest(org.mozilla.geckoview.test.PrintDelegateTest):
[task 2023-05-28T23:31:07.681Z] 23:31:07     INFO -  org.mozilla.geckoview.test | org.mozilla.geckoview.test.util.UiThreadUtils$TimeoutException: Timed out after 30000ms
[task 2023-05-28T23:31:07.681Z] 23:31:07     INFO -  org.mozilla.geckoview.test | 	at org.mozilla.geckoview.test.util.UiThreadUtils$TimeoutRunnable.run(UiThreadUtils.java:49)
[task 2023-05-28T23:31:07.681Z] 23:31:07     INFO -  org.mozilla.geckoview.test | 	at android.os.Handler.handleCallback(Handler.java:751)
[task 2023-05-28T23:31:07.681Z] 23:31:07     INFO -  org.mozilla.geckoview.test | 	at android.os.Handler.dispatchMessage(Handler.java:95)
[task 2023-05-28T23:31:07.681Z] 23:31:07     INFO -  org.mozilla.geckoview.test | 	at org.mozilla.geckoview.test.util.UiThreadUtils.waitForCondition(UiThreadUtils.java:158)
[task 2023-05-28T23:31:07.682Z] 23:31:07     INFO -  org.mozilla.geckoview.test | 	at org.mozilla.geckoview.test.util.UiThreadUtils.waitForResult(UiThreadUtils.java:79)
[task 2023-05-28T23:31:07.682Z] 23:31:07     INFO -  org.mozilla.geckoview.test | 	at org.mozilla.geckoview.test.rule.GeckoSessionTestRule.waitForResult(GeckoSessionTestRule.java:2911)
[task 2023-05-28T23:31:07.682Z] 23:31:07     INFO -  org.mozilla.geckoview.test | 	at org.mozilla.geckoview.test.rule.GeckoSessionTestRule.waitForResult(GeckoSessionTestRule.java:2896)
[task 2023-05-28T23:31:07.682Z] 23:31:07     INFO -  org.mozilla.geckoview.test | 	at org.mozilla.geckoview.test.PrintDelegateTest.iframeWindowDotPrintTest$lambda$13(PrintDelegateTest.kt:231)
[task 2023-05-28T23:31:07.682Z] 23:31:07     INFO -  org.mozilla.geckoview.test | 	at org.mozilla.geckoview.test.PrintDelegateTest.$r8$lambda$dCGe_cf0iq3LprYWWsG_tvCAQU0(PrintDelegateTest.kt)
[task 2023-05-28T23:31:07.682Z] 23:31:07     INFO -  org.mozilla.geckoview.test | 	at org.mozilla.geckoview.test.PrintDelegateTest$$ExternalSyntheticLambda13.perform(D8$$SyntheticClass)
[task 2023-05-28T23:31:07.682Z] 23:31:07     INFO -  org.mozilla.geckoview.test | 	at androidx.test.core.app.ActivityScenario.lambda$onActivity$2$androidx-test-core-app-ActivityScenario(ActivityScenario.java:789)
[task 2023-05-28T23:31:07.683Z] 23:31:07     INFO -  org.mozilla.geckoview.test | 	at androidx.test.core.app.ActivityScenario$$ExternalSyntheticLambda2.run(D8$$SyntheticClass)
[task 2023-05-28T23:31:07.683Z] 23:31:07     INFO -  org.mozilla.geckoview.test | 	at androidx.test.core.app.ActivityScenario.onActivity(ActivityScenario.java:799)
[task 2023-05-28T23:31:07.683Z] 23:31:07     INFO -  org.mozilla.geckoview.test | 	at org.mozilla.geckoview.test.PrintDelegateTest.iframeWindowDotPrintTest(PrintDelegateTest.kt:220)
[task 2023-05-28T23:31:07.683Z] 23:31:07     INFO -  org.mozilla.geckoview.test |
[task 2023-05-28T23:31:07.683Z] 23:31:07     INFO -  org.mozilla.geckoview.test | INSTRUMENTATION_STATUS: id=AndroidJUnitRunner
<...>
[task 2023-05-28T23:31:08.393Z] 23:31:08     INFO -  05-28 23:30:36.866 D/ServiceAllocator( 3449): org.mozilla.gecko.process.GeckoChildProcessServices$gpu updateBindings: IDLE priority, 0 importance, 0 successful binds, 0 failed binds, 2 successful unbinds
[task 2023-05-28T23:31:08.393Z] 23:31:08     INFO -  05-28 23:30:36.869 D/GeckoViewClipboardPermissionParent( 3449): receiveMessage: DispatcherMessage
[task 2023-05-28T23:31:08.394Z] 23:31:08     INFO -  05-28 23:30:36.870 D/GeckoViewActorParent( 3449): receiveMessage window destroyed DispatcherMessage GeckoView:DismissClipboardPermissionRequest
[task 2023-05-28T23:31:08.394Z] 23:31:08     INFO -  05-28 23:31:06.880 E/GeckoSessionTestRule( 3449): Error
[task 2023-05-28T23:31:08.394Z] 23:31:08     INFO -  05-28 23:31:06.880 E/GeckoSessionTestRule( 3449): org.mozilla.geckoview.test.util.UiThreadUtils$TimeoutException: Timed out after 30000ms
[task 2023-05-28T23:31:08.394Z] 23:31:08     INFO -  05-28 23:31:06.880 E/GeckoSessionTestRule( 3449): 	at org.mozilla.geckoview.test.util.UiThreadUtils$TimeoutRunnable.run(UiThreadUtils.java:49)
[task 2023-05-28T23:31:08.394Z] 23:31:08     INFO -  05-28 23:31:06.880 E/GeckoSessionTestRule( 3449): 	at android.os.Handler.handleCallback(Handler.java:751)
[task 2023-05-28T23:31:08.394Z] 23:31:08     INFO -  05-28 23:31:06.880 E/GeckoSessionTestRule( 3449): 	at android.os.Handler.dispatchMessage(Handler.java:95)
[task 2023-05-28T23:31:08.394Z] 23:31:08     INFO -  05-28 23:31:06.880 E/GeckoSessionTestRule( 3449): 	at org.mozilla.geckoview.test.util.UiThreadUtils.waitForCondition(UiThreadUtils.java:158)
[task 2023-05-28T23:31:08.395Z] 23:31:08     INFO -  05-28 23:31:06.880 E/GeckoSessionTestRule( 3449): 	at org.mozilla.geckoview.test.util.UiThreadUtils.waitForResult(UiThreadUtils.java:79)
[task 2023-05-28T23:31:08.395Z] 23:31:08     INFO -  05-28 23:31:06.880 E/GeckoSessionTestRule( 3449): 	at org.mozilla.geckoview.test.rule.GeckoSessionTestRule.waitForResult(GeckoSessionTestRule.java:2911)
[task 2023-05-28T23:31:08.395Z] 23:31:08     INFO -  05-28 23:31:06.880 E/GeckoSessionTestRule( 3449): 	at org.mozilla.geckoview.test.rule.GeckoSessionTestRule.waitForResult(GeckoSessionTestRule.java:2896)
[task 2023-05-28T23:31:08.395Z] 23:31:08     INFO -  05-28 23:31:06.880 E/GeckoSessionTestRule( 3449): 	at org.mozilla.geckoview.test.PrintDelegateTest.iframeWindowDotPrintTest$lambda$13(PrintDelegateTest.kt:231)
[task 2023-05-28T23:31:08.395Z] 23:31:08     INFO -  05-28 23:31:06.880 E/GeckoSessionTestRule( 3449): 	at org.mozilla.geckoview.test.PrintDelegateTest.$r8$lambda$dCGe_cf0iq3LprYWWsG_tvCAQU0(PrintDelegateTest.kt)
[task 2023-05-28T23:31:08.395Z] 23:31:08     INFO -  05-28 23:31:06.880 E/GeckoSessionTestRule( 3449): 	at org.mozilla.geckoview.test.PrintDelegateTest$$ExternalSyntheticLambda13.perform(D8$$SyntheticClass)
[task 2023-05-28T23:31:08.396Z] 23:31:08     INFO -  05-28 23:31:06.880 E/GeckoSessionTestRule( 3449): 	at androidx.test.core.app.ActivityScenario.lambda$onActivity$2$androidx-test-core-app-ActivityScenario(ActivityScenario.java:789)
[task 2023-05-28T23:31:08.396Z] 23:31:08     INFO -  05-28 23:31:06.880 E/GeckoSessionTestRule( 3449): 	at androidx.test.core.app.ActivityScenario$$ExternalSyntheticLambda2.run(D8$$SyntheticClass)
[task 2023-05-28T23:31:08.396Z] 23:31:08     INFO -  05-28 23:31:06.880 E/GeckoSessionTestRule( 3449): 	at androidx.test.core.app.ActivityScenario.onActivity(ActivityScenario.java:799)
[task 2023-05-28T23:31:08.396Z] 23:31:08     INFO -  05-28 23:31:06.880 E/GeckoSessionTestRule( 3449): 	at org.mozilla.geckoview.test.PrintDelegateTest.iframeWindowDotPrintTest(PrintDelegateTest.kt:220)
[task 2023-05-28T23:31:08.396Z] 23:31:08     INFO -  05-28 23:31:06.880 E/GeckoSessionTestRule( 3449): 	at java.lang.reflect.Method.invoke(Native Method)
[task 2023-05-28T23:31:08.396Z] 23:31:08     INFO -  05-28 23:31:06.880 E/GeckoSessionTestRule( 3449): 	at org.junit.runners.model.FrameworkMethod$1.runReflectiveCall(FrameworkMethod.java:59)
[task 2023-05-28T23:31:08.396Z] 23:31:08     INFO -  05-28 23:31:06.880 E/GeckoSessionTestRule( 3449): 	at org.junit.internal.runners.model.ReflectiveCallable.run(ReflectiveCallable.java:12)
[task 2023-05-28T23:31:08.396Z] 23:31:08     INFO -  05-28 23:31:06.880 E/GeckoSessionTestRule( 3449): 	at org.junit.runners.model.FrameworkMethod.invokeExplosively(FrameworkMethod.java:56)
[task 2023-05-28T23:31:08.396Z] 23:31:08     INFO -  05-28 23:31:06.880 E/GeckoSessionTestRule( 3449): 	at org.junit.internal.runners.statements.InvokeMethod.evaluate(InvokeMethod.java:17)
[task 2023-05-28T23:31:08.397Z] 23:31:08     INFO -  05-28 23:31:06.880 E/GeckoSessionTestRule( 3449): 	at androidx.test.internal.runner.junit4.statement.RunBefores.evaluate(RunBefores.java:80)
[task 2023-05-28T23:31:08.397Z] 23:31:08     INFO -  05-28 23:31:06.880 E/GeckoSessionTestRule( 3449): 	at androidx.test.internal.runner.junit4.statement.RunAfters.evaluate(RunAfters.java:61)
[task 2023-05-28T23:31:08.397Z] 23:31:08     INFO -  05-28 23:31:06.880 E/GeckoSessionTestRule( 3449): 	at org.mozilla.geckoview.test.rule.GeckoSessionTestRule$2.lambda$evaluate$0$org-mozilla-geckoview-test-rule-GeckoSessionTestRule$2(GeckoSessionTestRule.java:1476)
[task 2023-05-28T23:31:08.397Z] 23:31:08     INFO -  05-28 23:31:06.880 E/GeckoSessionTestRule( 3449): 	at org.mozilla.geckoview.test.rule.GeckoSessionTestRule$2$$ExternalSyntheticLambda1.run(D8$$SyntheticClass)
[task 2023-05-28T23:31:08.397Z] 23:31:08     INFO -  05-28 23:31:06.880 E/GeckoSessionTestRule( 3449): 	at java.util.concurrent.Executors$RunnableAdapter.call(Executors.java:428)
[task 2023-05-28T23:31:08.397Z] 23:31:08     INFO -  05-28 23:31:06.880 E/GeckoSessionTestRule( 3449): 	at java.util.concurrent.FutureTask.run(FutureTask.java:237)
[task 2023-05-28T23:31:08.398Z] 23:31:08     INFO -  05-28 23:31:06.880 E/GeckoSessionTestRule( 3449): 	at android.app.Instrumentation$SyncRunnable.run(Instrumentation.java:1950)
[task 2023-05-28T23:31:08.398Z] 23:31:08     INFO -  05-28 23:31:06.880 E/GeckoSessionTestRule( 3449): 	at android.os.Handler.handleCallback(Handler.java:751)
[task 2023-05-28T23:31:08.398Z] 23:31:08     INFO -  05-28 23:31:06.880 E/GeckoSessionTestRule( 3449): 	at android.os.Handler.dispatchMessage(Handler.java:95)
[task 2023-05-28T23:31:08.398Z] 23:31:08     INFO -  05-28 23:31:06.880 E/GeckoSessionTestRule( 3449): 	at android.os.Looper.loop(Looper.java:154)
[task 2023-05-28T23:31:08.398Z] 23:31:08     INFO -  05-28 23:31:06.880 E/GeckoSessionTestRule( 3449): 	at android.app.ActivityThread.main(ActivityThread.java:6077)
[task 2023-05-28T23:31:08.398Z] 23:31:08     INFO -  05-28 23:31:06.880 E/GeckoSessionTestRule( 3449): 	at java.lang.reflect.Method.invoke(Native Method)
[task 2023-05-28T23:31:08.398Z] 23:31:08     INFO -  05-28 23:31:06.880 E/GeckoSessionTestRule( 3449): 	at com.android.internal.os.ZygoteInit$MethodAndArgsCaller.run(ZygoteInit.java:866)
[task 2023-05-28T23:31:08.399Z] 23:31:08     INFO -  05-28 23:31:06.880 E/GeckoSessionTestRule( 3449): 	at com.android.internal.os.ZygoteInit.main(ZygoteInit.java:756)
[task 2023-05-28T23:31:08.399Z] 23:31:08     INFO -  05-28 23:31:06.882 D/GeckoViewConsole( 3449): onEvent GeckoView:WebExtension:PortMessageFromApp {"message":{"id":"bf06a311-efaa-42a4-b8d5-bf1456afc9f9","args":{"oldPrefs":{"dom.enable_window_print":true}},"type":"RestorePrefs"}}
[task 2023-05-28T23:31:08.399Z] 23:31:08     INFO -  05-28 23:31:06.894 D/GeckoViewContent( 3449): handleEvent: DOMWindowClose
[task 2023-05-28T23:31:08.399Z] 23:31:08     INFO -  05-28 23:31:06.896 D/GeckoViewConsole( 3449): onEvent GeckoView:WebExtension:List null
[task 2023-05-28T23:31:08.399Z] 23:31:08     INFO -  05-28 23:31:06.899 E/GeckoSessionTestRule( 3449): test_end c5ee677f-bc83-49bd-9e28-2d35f3d0f059 iframeWindowDotPrintTest(org.mozilla.geckoview.test.PrintDelegateTest)
[task 2023-05-28T23:31:08.400Z] 23:31:08  WARNING -  TEST-UNEXPECTED-FAIL | org.mozilla.geckoview.test.PrintDelegateTest#iframeWindowDotPrintTest | org.mozilla.geckoview.test.util.UiThreadUtils$TimeoutException: Timed out after 30000ms
[task 2023-05-28T23:31:08.400Z] 23:31:08     INFO -  TEST-INFO took 33572ms
[task 2023-05-28T23:31:08.400Z] 23:31:08     INFO -  org.mozilla.geckoview.test | INSTRUMENTATION_STATUS: numtests=1032
[task 2023-05-28T23:31:08.400Z] 23:31:08     INFO -  org.mozilla.geckoview.test | INSTRUMENTATION_STATUS: stream=
[task 2023-05-28T23:31:08.400Z] 23:31:08     INFO -  org.mozilla.geckoview.test | INSTRUMENTATION_STATUS: id=AndroidJUnitRunner
[task 2023-05-28T23:31:08.400Z] 23:31:08     INFO -  org.mozilla.geckoview.test | INSTRUMENTATION_STATUS: test=contentIframeWindowDotPrintTest
[task 2023-05-28T23:31:08.400Z] 23:31:08     INFO -  org.mozilla.geckoview.test | INSTRUMENTATION_STATUS: class=org.mozilla.geckoview.test.PrintDelegateTest
[task 2023-05-28T23:31:08.400Z] 23:31:08     INFO -  org.mozilla.geckoview.test | INSTRUMENTATION_STATUS: current=542
[task 2023-05-28T23:31:08.400Z] 23:31:08     INFO -  org.mozilla.geckoview.test | INSTRUMENTATION_STATUS_CODE: 1
[task 2023-05-28T23:31:08.401Z] 23:31:08     INFO -  TEST-START | org.mozilla.geckoview.test.PrintDelegateTest#contentIframeWindowDotPrintTest
Status: NEW → RESOLVED
Closed: 3 years ago
Resolution: --- → INCOMPLETE
Status: RESOLVED → REOPENED
Resolution: INCOMPLETE → ---
Status: REOPENED → RESOLVED
Closed: 3 years ago2 years ago
Resolution: --- → INCOMPLETE
Status: RESOLVED → REOPENED
Resolution: INCOMPLETE → ---
Status: REOPENED → RESOLVED
Closed: 2 years ago2 years ago
Resolution: --- → INCOMPLETE
Status: RESOLVED → REOPENED
Resolution: INCOMPLETE → ---
Status: REOPENED → RESOLVED
Closed: 2 years ago2 years ago
Resolution: --- → INCOMPLETE
Status: RESOLVED → REOPENED
Resolution: INCOMPLETE → ---
Status: REOPENED → RESOLVED
Closed: 2 years ago2 years ago
Resolution: --- → INCOMPLETE
Status: RESOLVED → REOPENED
Resolution: INCOMPLETE → ---
Status: REOPENED → RESOLVED
Closed: 2 years ago1 year ago
Resolution: --- → INCOMPLETE
Status: RESOLVED → REOPENED
Resolution: INCOMPLETE → ---
Status: REOPENED → RESOLVED
Closed: 1 year ago1 year ago
Resolution: --- → INCOMPLETE
Status: RESOLVED → REOPENED
Resolution: INCOMPLETE → ---
Status: REOPENED → RESOLVED
Closed: 1 year ago1 year ago
Resolution: --- → INCOMPLETE
Status: RESOLVED → REOPENED
Resolution: INCOMPLETE → ---
Status: REOPENED → RESOLVED
Closed: 1 year ago10 months ago
Resolution: --- → INCOMPLETE
You need to log in before you can comment on or make changes to this bug.