Closed
Bug 1881445
Opened 2 years ago
Closed 2 years ago
Perma macOS /builds/worker/checkouts/gecko/dom/media/systemservices/objc_video_capture/video_capture_avfoundation.mm:91:3: error: no template named 'scoped_refptr'
Categories
(Core :: Audio/Video, defect, P5)
Core
Audio/Video
Tracking
()
RESOLVED
FIXED
125 Branch
| Tracking | Status | |
|---|---|---|
| firefox-esr115 | --- | unaffected |
| firefox123 | --- | unaffected |
| firefox124 | --- | unaffected |
| firefox125 | --- | fixed |
People
(Reporter: intermittent-bug-filer, Assigned: jib)
References
(Regression)
Details
(Keywords: intermittent-failure, regression)
Attachments
(1 file, 1 obsolete file)
Filed by: pstanciu [at] mozilla.com
Parsed log: https://treeherder.mozilla.org/logviewer?job_id=448032340&repo=autoland
Full log: https://firefox-ci-tc.services.mozilla.com/api/queue/v1/task/PkqNx63YSpmdkbxocQC1yQ/runs/0/artifacts/public/logs/live_backing.log
[task 2024-02-22T10:30:13.979Z] 10:30:13 INFO - gmake[4]: Leaving directory '/builds/worker/workspace/obj-build/dom/reporting'
[task 2024-02-22T10:30:13.979Z] 10:30:13 INFO - gmake[4]: Entering directory '/builds/worker/workspace/obj-build/dom/reporting'
[task 2024-02-22T10:30:13.979Z] 10:30:13 INFO - dom/reporting/ReportBody.o
[task 2024-02-22T10:30:13.979Z] 10:30:13 INFO - gmake[4]: Leaving directory '/builds/worker/workspace/obj-build/dom/reporting'
[task 2024-02-22T10:30:14.101Z] 10:30:14 INFO - gmake[4]: Entering directory '/builds/worker/workspace/obj-build/dom/media/systemservices'
[task 2024-02-22T10:30:14.105Z] 10:30:14 INFO - /builds/worker/fetches/sccache/sccache /builds/worker/fetches/clang/bin/clang++ -isysroot /builds/worker/fetches/MacOSX14.2.sdk -mmacosx-version-min=10.15 -stdlib=libc++ --target=x86_64-apple-darwin -o video_capture_avfoundation.o -c -I/builds/worker/workspace/obj-build/dist/stl_wrappers -fvisibility=hidden -fvisibility-inlines-hidden -U_FORTIFY_SOURCE -D_FORTIFY_SOURCE=2 -fstack-protector-strong -DNDEBUG=1 -DTRIMMED=1 -DHAVE_UINT64_T -DWEBRTC_MOZILLA_BUILD -DRTC_ENABLE_VP9 -DWEBRTC_POSIX -DWEBRTC_BUILD_LIBEVENT -DWEBRTC_MAC -DMOZ_HAS_MOZGLUE -DMOZILLA_INTERNAL_API -DIMPL_LIBXUL -DSTATIC_EXPORTABLE_JS_API -I/builds/worker/checkouts/gecko/dom/media/systemservices -I/builds/worker/workspace/obj-build/dom/media/systemservices -I/builds/worker/checkouts/gecko/dom/media/webrtc -I/builds/worker/checkouts/gecko/media/libyuv/libyuv/include -I/builds/worker/checkouts/gecko/mfbt -I/builds/worker/checkouts/gecko/third_party/libwebrtc -I/builds/worker/checkouts/gecko/third_party/libwebrtc/third_party/abseil-cpp -I/builds/worker/checkouts/gecko/tools/profiler/public -I/builds/worker/checkouts/gecko/third_party/libwebrtc/sdk/objc -I/builds/worker/checkouts/gecko/third_party/libwebrtc/sdk/objc/base -I/builds/worker/workspace/obj-build/ipc/ipdl/_ipdlheaders -I/builds/worker/checkouts/gecko/ipc/chromium/src -I/builds/worker/workspace/obj-build/dist/include -I/builds/worker/workspace/obj-build/dist/include/nspr -I/builds/worker/workspace/obj-build/dist/include/nss -DMOZILLA_CLIENT -include /builds/worker/workspace/obj-build/mozilla-config.h -fno-sized-deallocation -fno-aligned-new -fcrash-diagnostics-dir=/builds/worker/artifacts -fno-exceptions -fPIC -fno-rtti -ffunction-sections -fdata-sections -fno-exceptions -fno-math-errno -gdwarf-4 -Xclang -load -Xclang /builds/worker/workspace/obj-build/build/clang-plugin/libclang-plugin.so -Xclang -add-plugin -Xclang moz-check -O3 -fno-omit-frame-pointer -funwind-tables -Werror -Wall -Wbitfield-enum-conversion -Wdeprecated-this-capture -Wempty-body -Wformat-type-confusion -Wignored-qualifiers -Wpointer-arith -Wshadow-field-in-constructor-modified -Wsign-compare -Wtautological-constant-in-range-compare -Wtype-limits -Wno-error=tautological-type-limit-compare -Wunreachable-code -Wunreachable-code-return -Wunused-but-set-parameter -Wno-invalid-offsetof -Wclass-varargs -Wempty-init-stmt -Wfloat-overflow-conversion -Wfloat-zero-conversion -Wloop-analysis -Wno-range-loop-analysis -Wc++2a-compat -Wenum-compare-conditional -Wenum-float-conversion -Wno-error=deprecated -Wno-error=deprecated-anon-enum-enum-conversion -Wno-error=deprecated-enum-enum-conversion -Wno-error=deprecated-pragma -Wno-error=deprecated-this-capture -Wcomma -Wimplicit-fallthrough -Wduplicate-method-arg -Wduplicate-method-match -Wmissing-method-return-type -Wobjc-signed-char-bool -Wsemicolon-before-method-body -Wsuper-class-method-mismatch -Wstring-conversion -Wno-inline-new-delete -Wno-error=deprecated-declarations -Wno-error=array-bounds -Wno-error=free-nonheap-object -Wno-error=atomic-alignment -Wno-error=deprecated-builtins -Wformat -Wformat-security -Wno-psabi -Wthread-safety -Werror=unguarded-availability-new -Wno-error=builtin-macro-redefined -Wno-unknown-warning-option -fno-strict-aliasing -ffp-contract=off -MD -MP -MF .deps/video_capture_avfoundation.o.pp -x objective-c++ -fobjc-exceptions -fobjc-arc /builds/worker/checkouts/gecko/dom/media/systemservices/objc_video_capture/video_capture_avfoundation.mm
[task 2024-02-22T10:30:14.105Z] 10:30:14 ERROR - /builds/worker/checkouts/gecko/dom/media/systemservices/objc_video_capture/video_capture_avfoundation.mm:91:3: error: no template named 'scoped_refptr'
[task 2024-02-22T10:30:14.106Z] 10:30:14 INFO - 91 | scoped_refptr<webrtc::videocapturemodule::VideoCaptureAvFoundation> cap;
[task 2024-02-22T10:30:14.106Z] 10:30:14 INFO - | ^
[task 2024-02-22T10:30:14.106Z] 10:30:14 ERROR - /builds/worker/checkouts/gecko/dom/media/systemservices/objc_video_capture/video_capture_avfoundation.mm:94:11: error: use of undeclared identifier 'scoped_refptr'
[task 2024-02-22T10:30:14.106Z] 10:30:14 INFO - 94 | cap = scoped_refptr(_capturer);
[task 2024-02-22T10:30:14.107Z] 10:30:14 INFO - | ^
[task 2024-02-22T10:30:14.107Z] 10:30:14 INFO - 2 errors generated.
[task 2024-02-22T10:30:14.107Z] 10:30:14 ERROR - gmake[4]: *** [/builds/worker/checkouts/gecko/config/rules.mk:700: video_capture_avfoundation.o] Error 1
[task 2024-02-22T10:30:14.107Z] 10:30:14 INFO - gmake[4]: Leaving directory '/builds/worker/workspace/obj-build/dom/media/systemservices'
[task 2024-02-22T10:30:14.107Z] 10:30:14 INFO - gmake[4]: Target 'target-objects' not remade because of errors.
[task 2024-02-22T10:30:14.108Z] 10:30:14 ERROR - gmake[3]: *** [/builds/worker/checkouts/gecko/config/recurse.mk:72: dom/media/systemservices/target-objects] Error 2
[task 2024-02-22T10:30:14.108Z] 10:30:14 INFO - gmake[4]: Entering directory '/builds/worker/workspace/obj-build/dom/media'
[task 2024-02-22T10:30:14.109Z] 10:30:14 INFO - dom/media/Tracing.o
[task 2024-02-22T10:30:14.109Z] 10:30:14 INFO - gmake[4]: Leaving directory '/builds/worker/workspace/obj-build/dom/media'
[task 2024-02-22T10:30:14.207Z] 10:30:14 INFO - gmake[4]: Entering directory '/builds/worker/workspace/obj-build/dom/ipc'
[task 2024-02-22T10:30:14.212Z] 10:30:14 INFO - /builds/worker/fetches/sccache/sccache /builds/worker/fetches/clang/bin/clang++ -isysroot /builds/worker/fetches/MacOSX14.2.sdk -mmacosx-version-min=10.15 -stdlib=libc++ --target=x86_64-apple-darwin -o PWindowGlobalParent.o -c -I/builds/worker/workspace/obj-build/dist/stl_wrappers -fvisibility=hidden -fvisibility-inlines-hidden -U_FORTIFY_SOURCE -D_FORTIFY_SOURCE=2 -fstack-protector-strong -DNDEBUG=1 -DTRIMMED=1 '-DBIN_SUFFIX=""' '-DMOZ_APP_NAME="firefox"' -DMOZ_HAS_MOZGLUE -DMOZILLA_INTERNAL_API -DIMPL_LIBXUL -DSTATIC_EXPORTABLE_JS_API -I/builds/worker/checkouts/gecko/dom/ipc -I/builds/worker/workspace/obj-build/dom/ipc -I/builds/worker/workspace/obj-build/ipc/ipdl/_ipdlheaders -I/builds/worker/checkouts/gecko/ipc/chromium/src -I/builds/worker/checkouts/gecko/caps -I/builds/worker/checkouts/gecko/chrome -I/builds/worker/checkouts/gecko/docshell/base -I/builds/worker/checkouts/gecko/dom/base -I/builds/worker/checkouts/gecko/dom/bindings -I/builds/worker/checkouts/gecko/dom/events -I/builds/worker/checkouts/gecko/dom/filesystem -I/builds/worker/checkouts/gecko/dom/geolocation -I/builds/worker/checkouts/gecko/dom/media/webrtc -I/builds/worker/checkouts/gecko/dom/media/webspeech/synth/ipc -I/builds/worker/checkouts/gecko/dom/security -I/builds/worker/checkouts/gecko/dom/storage -I/builds/worker/checkouts/gecko/extensions/spellcheck/src -I/builds/worker/checkouts/gecko/gfx/2d -I/builds/worker/checkouts/gecko/hal/sandbox -I/builds/worker/checkouts/gecko/js/xpconnect/loader -I/builds/worker/checkouts/gecko/js/xpconnect/src -I/builds/worker/checkouts/gecko/layout/base -I/builds/worker/checkouts/gecko/media/webrtc -I/builds/worker/checkouts/gecko/netwerk/base -I/builds/worker/checkouts/gecko/netwerk/dns -I/builds/worker/checkouts/gecko/netwerk/protocol/http -I/builds/worker/checkouts/gecko/toolkit/components/printingui/ipc -I/builds/worker/checkouts/gecko/toolkit/crashreporter -I/builds/worker/checkouts/gecko/toolkit/xre -I/builds/worker/checkouts/gecko/uriloader/exthandler -I/builds/worker/checkouts/gecko/widget -I/builds/worker/checkouts/gecko/xpcom/base -I/builds/worker/checkouts/gecko/xpcom/threads -I/builds/worker/checkouts/gecko/modules/libjar -I/builds/worker/workspace/obj-build/dist/include -I/builds/worker/workspace/obj-build/dist/include/nspr -I/builds/worker/workspace/obj-build/dist/include/nss -DMOZILLA_CLIENT -include /builds/worker/workspace/obj-build/mozilla-config.h -fno-sized-deallocation -fno-aligned-new -fcrash-diagnostics-dir=/builds/worker/artifacts -fno-exceptions -fPIC -fno-rtti -ffunction-sections -fdata-sections -fno-exceptions -fno-math-errno -gdwarf-4 -Xclang -load -Xclang /builds/worker/workspace/obj-build/build/clang-plugin/libclang-plugin.so -Xclang -add-plugin -Xclang moz-check -O3 -fno-omit-frame-pointer -funwind-tables -Werror -Wall -Wbitfield-enum-conversion -Wdeprecated-this-capture -Wempty-body -Wformat-type-confusion -Wignored-qualifiers -Wpointer-arith -Wshadow-field-in-constructor-modified -Wsign-compare -Wtautological-constant-in-range-compare -Wtype-limits -Wno-error=tautological-type-limit-compare -Wunreachable-code -Wunreachable-code-return -Wunused-but-set-parameter -Wno-invalid-offsetof -Wclass-varargs -Wempty-init-stmt -Wfloat-overflow-conversion -Wfloat-zero-conversion -Wloop-analysis -Wno-range-loop-analysis -Wc++2a-compat -Wenum-compare-conditional -Wenum-float-conversion -Wno-error=deprecated -Wno-error=deprecated-anon-enum-enum-conversion -Wno-error=deprecated-enum-enum-conversion -Wno-error=deprecated-pragma -Wno-error=deprecated-this-capture -Wcomma -Wimplicit-fallthrough -Wduplicate-method-arg -Wduplicate-method-match -Wmissing-method-return-type -Wobjc-signed-char-bool -Wsemicolon-before-method-body -Wsuper-class-method-mismatch -Wstring-conversion -Wno-inline-new-delete -Wno-error=deprecated-declarations -Wno-error=array-bounds -Wno-error=free-nonheap-object -Wno-error=atomic-alignment -Wno-error=deprecated-builtins -Wformat -Wformat-security -Wno-psabi -Wthread-safety -Werror=unguarded-availability-new -Wno-error=builtin-macro-redefined -Wno-unknown-warning-option -fno-strict-aliasing -ffp-contract=off -MD -MP -MF .deps/PWindowGlobalParent.o.pp /builds/worker/workspace/obj-build/ipc/ipdl/PWindowGlobalParent.cpp
[task 2024-02-22T10:30:14.212Z] 10:30:14 INFO - gmake[4]: Leaving directory '/builds/worker/workspace/obj-build/dom/ipc'
[task 2024-02-22T10:30:14.213Z] 10:30:14 INFO - gmake[4]: Entering directory '/builds/worker/workspace/obj-build/dom/ipc'
[task 2024-02-22T10:30:14.214Z] 10:30:14 INFO - gmake[4]: Leaving directory '/builds/worker/workspace/obj-build/dom/ipc'
[task 2024-02-22T10:30:14.222Z] 10:30:14 INFO - gmake[4]: Entering directory '/builds/worker/workspace/obj-build/dom/ipc'
Comment 1•2 years ago
|
||
Set release status flags based on info from the regressing bug 1876843
status-firefox123:
--- → unaffected
status-firefox124:
--- → unaffected
status-firefox125:
--- → affected
status-firefox-esr115:
--- → unaffected
| Assignee | ||
Comment 2•2 years ago
|
||
| Assignee | ||
Comment 3•2 years ago
|
||
Updated•2 years ago
|
Assignee: nobody → jib
Status: NEW → ASSIGNED
Pushed by jbruaroey@mozilla.com:
https://hg.mozilla.org/integration/autoland/rev/fd5dd8961d97
Fix non-unified build error in video_capture_avfoundation.mm. r=mjf
Comment 5•2 years ago
|
||
| bugherder | ||
Status: ASSIGNED → RESOLVED
Closed: 2 years ago
Resolution: --- → FIXED
Target Milestone: --- → 125 Branch
Updated•2 years ago
|
Attachment #9382164 -
Attachment is obsolete: true
| Assignee | ||
Updated•2 years ago
|
Flags: needinfo?(jib)
| Comment hidden (Intermittent Failures Robot) |
You need to log in
before you can comment on or make changes to this bug.
Description
•