Closed Bug 1885903 Opened 2 years ago Closed 2 years ago

Perma [tier 2] geckoview-docs gmake[3]: *** [backend.mk:539: mobile/android/.deps/android_apks.stub] Error 1

Categories

(Release Engineering :: Release Automation, defect, P5)

Tracking

(Not tracked)

RESOLVED DUPLICATE of bug 1885905

People

(Reporter: intermittent-bug-filer, Unassigned)

Details

(Keywords: intermittent-failure)

Filed by: ctuns [at] mozilla.com
Parsed log: https://treeherder.mozilla.org/logviewer?job_id=451105922&repo=mozilla-central
Full log: https://firefox-ci-tc.services.mozilla.com/api/queue/v1/task/L1hBvFW-SAuUlMpW6ONcjQ/runs/0/artifacts/public/logs/live_backing.log


[task 2024-03-18T13:55:41.509Z] 13:55:41     INFO -  > Task :config:jar
[task 2024-03-18T13:55:41.509Z] 13:55:41     INFO -  mozconfig.gradle> Loading mach environment into a gradle extension property
[task 2024-03-18T13:55:41.509Z] 13:55:41     INFO -  mozconfig.gradle> Loading mach environment into a gradle extension property
[task 2024-03-18T13:55:41.509Z] 13:55:41     INFO -  FAILURE: Build failed with an exception.
[task 2024-03-18T13:55:41.509Z] 13:55:41     INFO -  * What went wrong:
[task 2024-03-18T13:55:41.509Z] 13:55:41     INFO -  A problem occurred configuring project ':browser-engine-gecko'.
[task 2024-03-18T13:55:41.509Z] 13:55:41     INFO -  > Could not determine the dependencies of null.
[task 2024-03-18T13:55:41.509Z] 13:55:41     INFO -     > Could not resolve all task dependencies for configuration ':browser-engine-gecko:classpath'.
[task 2024-03-18T13:55:41.510Z] 13:55:41     INFO -        > Could not find gradle.plugin.com.jetbrains.python:gradle-python-envs:0.0.31.
[task 2024-03-18T13:55:41.510Z] 13:55:41     INFO -          Searched in the following locations:
[task 2024-03-18T13:55:41.510Z] 13:55:41     INFO -            - file:/builds/worker/fetches/android-gradle-dependencies/mozilla/gradle/plugin/com/jetbrains/python/gradle-python-envs/0.0.31/gradle-python-envs-0.0.31.pom
[task 2024-03-18T13:55:41.510Z] 13:55:41     INFO -            - file:/builds/worker/fetches/android-gradle-dependencies/google/gradle/plugin/com/jetbrains/python/gradle-python-envs/0.0.31/gradle-python-envs-0.0.31.pom
[task 2024-03-18T13:55:41.510Z] 13:55:41     INFO -            - file:/builds/worker/fetches/android-gradle-dependencies/central/gradle/plugin/com/jetbrains/python/gradle-python-envs/0.0.31/gradle-python-envs-0.0.31.pom
[task 2024-03-18T13:55:41.511Z] 13:55:41     INFO -            - file:/builds/worker/fetches/android-gradle-dependencies/gradle-plugins/gradle/plugin/com/jetbrains/python/gradle-python-envs/0.0.31/gradle-python-envs-0.0.31.pom
[task 2024-03-18T13:55:41.511Z] 13:55:41     INFO -            - file:/builds/worker/fetches/plugins.gradle.org/m2/gradle/plugin/com/jetbrains/python/gradle-python-envs/0.0.31/gradle-python-envs-0.0.31.pom
[task 2024-03-18T13:55:41.511Z] 13:55:41     INFO -          Required by:
[task 2024-03-18T13:55:41.511Z] 13:55:41     INFO -              project :browser-engine-gecko > com.jetbrains.python.envs:com.jetbrains.python.envs.gradle.plugin:0.0.31
[task 2024-03-18T13:55:41.511Z] 13:55:41     INFO -  * Try:
[task 2024-03-18T13:55:41.511Z] 13:55:41     INFO -  > Run with --stacktrace option to get the stack trace.
[task 2024-03-18T13:55:41.511Z] 13:55:41     INFO -  > Run with --info or --debug option to get more log output.
[task 2024-03-18T13:55:41.511Z] 13:55:41     INFO -  > Run with --scan to get full insights.
[task 2024-03-18T13:55:41.511Z] 13:55:41     INFO -  > Get more help at https://help.gradle.org.
[task 2024-03-18T13:55:41.512Z] 13:55:41     INFO -  Deprecated Gradle features were used in this build, making it incompatible with Gradle 9.0.
[task 2024-03-18T13:55:41.512Z] 13:55:41     INFO -  You can use '--warning-mode all' to show the individual deprecation warnings and determine if they come from your own scripts or plugins.
[task 2024-03-18T13:55:41.512Z] 13:55:41     INFO -  For more on this, please refer to https://docs.gradle.org/8.6/userguide/command_line_interface.html#sec:command_line_warnings in the Gradle documentation.
[task 2024-03-18T13:55:41.512Z] 13:55:41     INFO -  BUILD FAILED in 1m 16s
[task 2024-03-18T13:55:41.512Z] 13:55:41     INFO -  25 actionable tasks: 25 executed
[task 2024-03-18T13:55:41.512Z] 13:55:41    ERROR -  Traceback (most recent call last):
[task 2024-03-18T13:55:41.512Z] 13:55:41     INFO -    File "/builds/worker/fetches/python/lib/python3.8/runpy.py", line 194, in _run_module_as_main
[task 2024-03-18T13:55:41.513Z] 13:55:41     INFO -      return _run_code(code, main_globals, None,
[task 2024-03-18T13:55:41.513Z] 13:55:41     INFO -    File "/builds/worker/fetches/python/lib/python3.8/runpy.py", line 87, in _run_code
[task 2024-03-18T13:55:41.513Z] 13:55:41     INFO -      exec(code, run_globals)
[task 2024-03-18T13:55:41.513Z] 13:55:41     INFO -    File "/builds/worker/checkouts/gecko/python/mozbuild/mozbuild/action/file_generate.py", line 154, in <module>
[task 2024-03-18T13:55:41.513Z] 13:55:41     INFO -      sys.exit(main(sys.argv[1:]))
[task 2024-03-18T13:55:41.513Z] 13:55:41     INFO -    File "/builds/worker/checkouts/gecko/python/mozbuild/mozbuild/action/file_generate.py", line 98, in main
[task 2024-03-18T13:55:41.513Z] 13:55:41     INFO -      ret = module.__dict__[method](
[task 2024-03-18T13:55:41.513Z] 13:55:41     INFO -    File "/builds/worker/checkouts/gecko/mobile/android/gradle.py", line 52, in assemble_app
[task 2024-03-18T13:55:41.514Z] 13:55:41     INFO -      return android("assemble-app")
[task 2024-03-18T13:55:41.514Z] 13:55:41     INFO -    File "/builds/worker/checkouts/gecko/mobile/android/gradle.py", line 46, in android
[task 2024-03-18T13:55:41.514Z] 13:55:41     INFO -      subprocess.check_call(cmd, env=env)
[task 2024-03-18T13:55:41.514Z] 13:55:41     INFO -    File "/builds/worker/fetches/python/lib/python3.8/subprocess.py", line 364, in check_call
[task 2024-03-18T13:55:41.514Z] 13:55:41     INFO -      raise CalledProcessError(retcode, cmd)
[task 2024-03-18T13:55:41.514Z] 13:55:41     INFO -  subprocess.CalledProcessError: Command '['/builds/worker/.mozbuild/srcdirs/gecko-8a5b87fe5d69/_virtualenvs/build/bin/python', '/builds/worker/checkouts/gecko/mach', 'android', 'assemble-app']' returned non-zero exit status 1.
[task 2024-03-18T13:55:41.514Z] 13:55:41    ERROR -  gmake[3]: *** [backend.mk:539: mobile/android/.deps/android_apks.stub] Error 1
[task 2024-03-18T13:55:41.515Z] 13:55:41     INFO -  gmake[3]: Leaving directory '/builds/worker/workspace/obj-build'
[task 2024-03-18T13:56:14.047Z] 13:56:14     INFO -  gmake[4]: Entering directory '/builds/worker/workspace/obj-build/widget/android'
[task 2024-03-18T13:56:14.048Z] 13:56:14     INFO -  /builds/worker/.mozbuild/srcdirs/gecko-8a5b87fe5d69/_virtualenvs/build/bin/python -m mozbuild.action.file_generate /builds/worker/checkouts/gecko/mobile/android/gradle.py generate_generated_jni_wrappers generated_jni_wrappers .deps/generated_jni_wrappers.pp .deps/generated_jni_wrappers.stub
[task 2024-03-18T13:56:14.048Z] 13:56:14     INFO -  /builds/worker/fetches/android-gradle-dependencies/gradle-dist/bin/gradle --console=plain geckoview:generateJNIWrappersForGeneratedWithGeckoBinariesDebug
[task 2024-03-18T13:56:14.048Z] 13:56:14     INFO -  Picked up JAVA_TOOL_OPTIONS: -Dfile.encoding=utf-8
[task 2024-03-18T13:56:14.048Z] 13:56:14     INFO -  To honour the JVM settings for this build a single-use Daemon process will be forked. For more on this, please refer to https://docs.gradle.org/8.6/userguide/gradle_daemon.html#sec:disabling_the_daemon in the Gradle documentation.
[task 2024-03-18T13:56:14.049Z] 13:56:14     INFO -  Daemon will be stopped at the end of the build
[task 2024-03-18T13:56:14.049Z] 13:56:14     INFO -  mozconfig.gradle> Loading mach environment into a gradle extension property
[task 2024-03-18T13:56:14.049Z] 13:56:14     INFO -  mozconfig.gradle> Loading mach environment into a gradle extension property
[task 2024-03-18T13:56:14.049Z] 13:56:14     INFO -  mozconfig.gradle> Loading mach environment into a gradle extension property
[task 2024-03-18T13:56:14.049Z] 13:56:14     INFO -  mozconfig.gradle> Loading mach environment into a gradle extension property
[task 2024-03-18T13:56:14.049Z] 13:56:14     INFO -  > Task :dependencies:checkKotlinGradlePluginConfigurationErrors
[task 2024-03-18T13:56:14.049Z] 13:56:14     INFO -  > Task :dependencies:compileKotlin UP-TO-DATE
[task 2024-03-18T13:56:14.050Z] 13:56:14     INFO -  > Task :dependencies:compileJava NO-SOURCE
[task 2024-03-18T13:56:14.050Z] 13:56:14     INFO -  > Task :dependencies:pluginDescriptors UP-TO-DATE
[task 2024-03-18T13:56:14.050Z] 13:56:14     INFO -  > Task :dependencies:processResources UP-TO-DATE
[task 2024-03-18T13:56:14.050Z] 13:56:14     INFO -  > Task :dependencies:classes UP-TO-DATE
[task 2024-03-18T13:56:14.050Z] 13:56:14     INFO -  > Task :dependencies:jar UP-TO-DATE
[task 2024-03-18T13:56:14.050Z] 13:56:14     INFO -  mozconfig.gradle> Loading mach environment into a gradle extension property
[task 2024-03-18T13:56:14.050Z] 13:56:14     INFO -  mozconfig.gradle> Loading mach environment into a gradle extension property
[task 2024-03-18T13:56:14.051Z] 13:56:14     INFO -  mozconfig.gradle> Loading mach environment into a gradle extension property
[task 2024-03-18T13:56:14.051Z] 13:56:14     INFO -  > Task :apksize:checkKotlinGradlePluginConfigurationErrors
[task 2024-03-18T13:56:14.051Z] 13:56:14     INFO -  > Task :config:checkKotlinGradlePluginConfigurationErrors
[task 2024-03-18T13:56:14.051Z] 13:56:14     INFO -  > Task :focusdependencies:checkKotlinGradlePluginConfigurationErrors
[task 2024-03-18T13:56:14.051Z] 13:56:14     INFO -  > Task :fenixdependencies:checkKotlinGradlePluginConfigurationErrors
[task 2024-03-18T13:56:14.051Z] 13:56:14     INFO -  > Task :config:compileKotlin UP-TO-DATE
[task 2024-03-18T13:56:14.051Z] 13:56:14     INFO -  > Task :apksize:compileKotlin UP-TO-DATE
[task 2024-03-18T13:56:14.051Z] 13:56:14     INFO -  > Task :fenixdependencies:compileKotlin UP-TO-DATE
[task 2024-03-18T13:56:14.052Z] 13:56:14     INFO -  > Task :apksize:compileJava NO-SOURCE
[task 2024-03-18T13:56:14.052Z] 13:56:14     INFO -  > Task :config:compileJava NO-SOURCE
[task 2024-03-18T13:56:14.052Z] 13:56:14     INFO -  > Task :fenixdependencies:compileJava NO-SOURCE
[task 2024-03-18T13:56:14.052Z] 13:56:14     INFO -  > Task :focusdependencies:compileKotlin UP-TO-DATE
[task 2024-03-18T13:56:14.052Z] 13:56:14     INFO -  > Task :apksize:pluginDescriptors UP-TO-DATE
[task 2024-03-18T13:56:14.052Z] 13:56:14     INFO -  > Task :config:pluginDescriptors UP-TO-DATE
[task 2024-03-18T13:56:14.052Z] 13:56:14     INFO -  > Task :fenixdependencies:pluginDescriptors UP-TO-DATE
[task 2024-03-18T13:56:14.052Z] 13:56:14     INFO -  > Task :focusdependencies:compileJava NO-SOURCE
[task 2024-03-18T13:56:14.053Z] 13:56:14     INFO -  > Task :fenixdependencies:processResources UP-TO-DATE
[task 2024-03-18T13:56:14.053Z] 13:56:14     INFO -  > Task :config:processResources UP-TO-DATE
Flags: needinfo?(jcristau)
Status: NEW → RESOLVED
Closed: 2 years ago
Duplicate of bug: 1885905
Flags: needinfo?(jcristau)
Resolution: --- → DUPLICATE
You need to log in before you can comment on or make changes to this bug.