Mozilla 1.7beta fails to compile on x86-64

RESOLVED EXPIRED

Status

SeaMonkey
General
RESOLVED EXPIRED
14 years ago
12 years ago

People

(Reporter: evan, Unassigned)

Tracking

Firefox Tracking Flags

(Not tracked)

Details

(Reporter)

Description

14 years ago
User-Agent:       Mozilla/5.0 (X11; U; Linux x86_64; en-US; rv:1.4) Gecko/20030819
Build Identifier: Mozilla/5.0 (X11; U; Linux x86_64; en-US; rv:1.4) Gecko/20030819

c++ -o xptcinvoke_gcc_x86_unix.o -c -DOSTYPE=\"Linux2.6\" -DOSARCH=\"Linux\"
-DEXPORT_XPTC_API   -I../../../../../../dist/include/xpcom
-I../../../../../../dist/include -I/home/eklinger/mozilla/dist/include/nspr    
-I./../.. -I/usr/X11R6/include   -fPIC  -I/usr/X11R6/include -fno-rtti
-fno-exceptions -Wall -Wconversion -Wpointer-arith -Wcast-align
-Woverloaded-virtual -Wsynth -Wno-ctor-dtor-privacy -Wno-non-virtual-dtor
-Wno-long-long -pedantic -fshort-wchar -pthread -pipe  -DDEBUG -D_DEBUG
-DDEBUG_eklinger -DTRACING -g -fno-inline  -I/usr/X11R6/include -DMOZILLA_CLIENT
-include ../../../../../../mozilla-config.h
-Wp,-MD,.deps/xptcinvoke_gcc_x86_unix.pp xptcinvoke_gcc_x86_unix.cpp
{standard input}: Assembler messages:
{standard input}:151: Error: suffix or operands invalid for `push'
{standard input}:153: Error: `0x10(%ebp)' is not a valid 64 bit base/index
expression
{standard input}:154: Error: `0(,%eax,8)' is not a valid 64 bit base/index
expression
{standard input}:158: Error: `0x14(%ebp)' is not a valid 64 bit base/index
expression
{standard input}:160: Error: `0x08(%ebp)' is not a valid 64 bit base/index
expression
{standard input}:161: Error: suffix or operands invalid for `push'
{standard input}:162: Error: `(%ecx)' is not a valid 64 bit base/index expression
{standard input}:163: Error: `0x0c(%ebp)' is not a valid 64 bit base/index
expression
{standard input}:164: Error: `(%edx,%eax,4)' is not a valid 64 bit base/index
expression
{standard input}:165: Error: `*(%edx)' is not a valid 64 bit base/index expression
{standard input}:167: Error: suffix or operands invalid for `pop'
gmake[7]: *** [xptcinvoke_gcc_x86_unix.o] Error 1
gmake[7]: Leaving directory
`/home/eklinger/mozilla/xpcom/reflect/xptcall/src/md/unix'
gmake[6]: *** [libs] Error 2
gmake[6]: Leaving directory `/home/eklinger/mozilla/xpcom/reflect/xptcall/src/md'
gmake[5]: *** [libs] Error 2
gmake[5]: Leaving directory `/home/eklinger/mozilla/xpcom/reflect/xptcall/src'
gmake[4]: *** [libs] Error 2
gmake[4]: Leaving directory `/home/eklinger/mozilla/xpcom/reflect/xptcall'


Reproducible: Always
Steps to Reproduce:
1. Enter source tree
2. ./configure
3. make

Actual Results:  
Compile error

Expected Results:  
Compiled

Comment 1

14 years ago
can you check bug 237202 and its dependencies ?
I believe this is dupe of bug 232742 or bug 163013.

Comment 2

14 years ago
Yeah, looks to me like this belongs on bug 225978 (which has lots of xptcinvoke
patches) or bug 232742 as the previous commenter pointed out. Note also the set
of patches for OpenBSD xptcinvoke on various platforms on bug 236599.
Product: Browser → Seamonkey
This is an automated message, with ID "auto-resolve01".

This bug has had no comments for a long time. Statistically, we have found that
bug reports that have not been confirmed by a second user after three months are
highly unlikely to be the source of a fix to the code.

While your input is very important to us, our resources are limited and so we
are asking for your help in focussing our efforts. If you can still reproduce
this problem in the latest version of the product (see below for how to obtain a
copy) or, for feature requests, if it's not present in the latest version and
you still believe we should implement it, please visit the URL of this bug
(given at the top of this mail) and add a comment to that effect, giving more
reproduction information if you have it.

If it is not a problem any longer, you need take no action. If this bug is not
changed in any way in the next two weeks, it will be automatically resolved.
Thank you for your help in this matter.

The latest beta releases can be obtained from:
Firefox:     http://www.mozilla.org/projects/firefox/
Thunderbird: http://www.mozilla.org/products/thunderbird/releases/1.5beta1.html
Seamonkey:   http://www.mozilla.org/projects/seamonkey/
This bug has been automatically resolved after a period of inactivity (see above
comment). If anyone thinks this is incorrect, they should feel free to reopen it.
Status: UNCONFIRMED → RESOLVED
Last Resolved: 12 years ago
Resolution: --- → EXPIRED
You need to log in before you can comment on or make changes to this bug.